atom feed1 message in org.netbeans.broken_builds[broken_builds] push-web-main #52185:...
FromSent OnAttachments
Hudson BuildsAug 26, 2016 3:23 am 
Subject:[broken_builds] push-web-main #52185: Failure
From:Hudson Builds (brok@netbeans.org)
Date:Aug 26, 2016 3:23:36 am
List:org.netbeans.broken_builds

http://deadlock.netbeans.org/job/push-web-main/52185/ Failure:

[ffj@netbeans.org] Merge of http://hg.netbeans.org/jet-main/

[ffj@netbeans.org] Automated merge with main-silver

[ffj@netbeans.org] Automated merge with main-silver

[ffj@netbeans.org] Automated merge with main-silver

[Dusan Balek <dba@netbeans.org>] Modified to fix failing sig test.

[Tomas Zezula <tzez@netbeans.org>] Automated merge with
http://hg.netbeans.org/jet-main/

[Tomas Zezula <tzez@netbeans.org>] Making compilable on older Ant.

[Dusan Balek <dba@netbeans.org>] Issue #258311 - Disjunctive exception catch
code formatting rule - fixed.

[ffj@netbeans.org] Automated merge with main-silver

[ffj@netbeans.org] Automated merge with main-silver

[ffj@netbeans.org] Automated merge with main-silver

[Milutin Kristofic <mkri@netbeans.org>] #267443 - NullPointerException at
org.netbeans.modules.editor.hints.HintsUI$4$1.run

[Miloslav Metelka <mmet@netbeans.org>] #262714 - Evaluate why certain
Actions are not logged.

[Svata Dedic <sde@netbeans.org>] Properly navigate into embeddings

[ffj@netbeans.org] Automated merge with main-silver

[Milutin Kristofic <mkri@netbeans.org>] #267657 - NullPointerException at
org.netbeans.modules.editor.NbToolTip.buildTip

[Miloslav Metelka <mmet@netbeans.org>] #267261 - [82cat] Right margin line
does not show on all lines.

[Tomas Stupka <tstu@netbeans.org>] Issue #267461 - AssertionError at
org.openide.awt.HtmlRendererImpl.reset

[Miloslav Metelka <mmet@netbeans.org>] #262273 - Shift modifier seems to be
ignored right after opening a file - selection not working right after file
opening.

[ffj@netbeans.org] Automated merge with main-silver

[ffj@netbeans.org] Automated merge with main-silver

[ffj@netbeans.org] Automated merge with main-silver

[Dusan Balek <dba@netbeans.org>] Issues #252312 and #246512 fixed.

[Tomas Zezula <tzez@netbeans.org>] Fixed signature test:
http://deadlock.netbeans.org/job/jet-main/2774

[Tomas Stupka <tstu@netbeans.org>] removed redundant license header

[Tomas Stupka <tstu@netbeans.org>] removed leading '*' from xml comments

[Tomas Stupka <tstu@netbeans.org>] Issue #267674 - Incorrect word in english
language

[ffj@netbeans.org] Automated merge with main-silver

[Milutin Kristofic <mkri@netbeans.org>] #258271 -
javax.swing.text.BadLocationException: Invalid offset=-1 < 0; docLen=20091

[Tomas Zezula <tzez@netbeans.org>] Fixed broken build:
http://deadlock.netbeans.org/job/jet-main/2772

[Tomas Zezula <tzez@netbeans.org>] Automated merge with
http://hg.netbeans.org/jet-main/

[Tomas Zezula <tzez@netbeans.org>] #267601:Need a preprocessor bridge API for
a compilation task

[ffj@netbeans.org] Automated merge with main-silver

[ffj@netbeans.org] Automated merge with main-silver

[Svata Dedic <sde@netbeans.org>] Automated merge with
http://hg.netbeans.org/jet-main

[Svata Dedic <sde@netbeans.org>] Constructors never collected in tree,
prevents confusing message about hidden selected elements when Selecting All

[Svata Dedic <sde@netbeans.org>] Discard comments from the original template
class

[Svata Dedic <sde@netbeans.org>] Comments frozen only for single unit
processing. Fixed comment handling when creating new CUs

[Svata Dedic <sde@netbeans.org>] #262724: changes batched into the next EDT
event

[Svata Dedic <sde@netbeans.org>] #258034: do not change visibility by default

[Svata Dedic <sde@netbeans.org>] #256793: diagnostic added to print tree with
wrong positions.

[ffj@netbeans.org] Automated merge with main-silver

[ffj@netbeans.org] Automated merge with main-silver

[ffj@netbeans.org] Automated merge with main-silver

[Tomas Zezula <tzez@netbeans.org>] Platform chooser handles per project
platform.

[Tomas Zezula <tzez@netbeans.org>] Automated merge with
http://hg.netbeans.org/jet-main/

[Tomas Zezula <tzez@netbeans.org>] Waiting for end of the cos update target.

[ffj@netbeans.org] Automated merge with main-silver

[Tomas Zezula <tzez@netbeans.org>] Automated merge with
http://hg.netbeans.org/jet-main/

[Tomas Zezula <tzez@netbeans.org>] #267489:Resolved API review comments.

[Tomas Zezula <tzez@netbeans.org>] #267489:Truffle 'mx netbeansinit' cannot
hardcode path to JDK

[Miloslav Metelka <mmet@netbeans.org>] #262728 - [82cat] New multi-caret
support has invalid key bindings for OS X - added extra Mac specific shortcuts.

[ffj@netbeans.org] Automated merge with main-silver

[ffj@netbeans.org] Automated merge with main-silver

[ffj@netbeans.org] Automated merge with main-silver

[ffj@netbeans.org] Automated merge with main-silver

[Svata Dedic <sde@netbeans.org>] Automated merge with
http://hg.netbeans.org/jet-main

[Svata Dedic <sde@netbeans.org>] #254751: retained only valid files in
refactoring context

[Svata Dedic <sde@netbeans.org>] #267520: typo in lang level declaration

[Svata Dedic <sde@netbeans.org>] #245762, #251562: diagnostics changed; no
snapshot should be created eagerly, damaged flag reset after rebuild

[Svata Dedic <sde@netbeans.org>] #267407: improved fold autoexpansion after
inserting text at the end of the fold content

[Svata Dedic <sde@netbeans.org>] #267407: compute end of import, do not rely
on javac

[Tomas Zezula <tzez@netbeans.org>] Automated merge with
http://hg.netbeans.org/jet-main/

[Tomas Zezula <tzez@netbeans.org>] Property $cos.update.resources holds
resource id.

[ffj@netbeans.org] Automated merge with main-silver

[Miloslav Metelka <mmet@netbeans.org>] #262728 - [82cat] New multi-caret
support has invalid key bindings for OS X.

[ffj@netbeans.org] Automated merge with main-silver

[ffj@netbeans.org] Automated merge with main-silver

[Milutin Kristofic <mkri@netbeans.org>] #258518 - the wrapping model for
JTree OptionsFilter$FilteringTreeModel doesn't delegate addition/removal of
listeners to the underlying model

[Tomas Zezula <tzez@netbeans.org>] Automated merge with
http://hg.netbeans.org/jet-main/

[Tomas Zezula <tzez@netbeans.org>] #252595:Missing "onsave" project hook for
J2SE Ant build.xml

[Tomas Zezula <tzez@netbeans.org>] Clean up.

[ffj@netbeans.org] Automated merge with main-silver

[ffj@netbeans.org] Automated merge with main-silver

[ffj@netbeans.org] Automated merge with main-silver

[ffj@netbeans.org] Automated merge with main-silver

[ffj@netbeans.org] Automated merge with main-silver

[ffj@netbeans.org] Automated merge with main-silver

[ffj@netbeans.org] Automated merge with main-silver

[ffj@netbeans.org] Automated merge with main-silver

[ffj@netbeans.org] Automated merge with main-silver

[ffj@netbeans.org] Automated merge with main-silver

[ffj@netbeans.org] Automated merge with main-silver

[ffj@netbeans.org] Automated merge with main-silver

[ffj@netbeans.org] Automated merge with main-silver

[...truncated 126496 lines...]

openide.util.lookup.default.init: Updating property file:
/space/workspace/push-web-main/nbbuild/netbeans/moduleCluster.properties

openide.util.lookup.build-init: Warning: module.javadoc.packages was already set to
org.openide.util,org.openide.util.lookup Loading module list from /tmp/nb-scan-cache-bf013985-standard.ser

openide.util.lookup.-javac-init-no-bootclasspath-prepend: Trying to override old definition of task nb-javac

openide.util.lookup.projectized-common.do-unit-test-build: Cannot handle -source 1.7 from this VM; forking null

openide.util.default.init: Updating property file:
/space/workspace/push-web-main/nbbuild/netbeans/moduleCluster.properties

openide.util.build-init: Loading module list from /tmp/nb-scan-cache-bf013985-standard.ser

openide.util.-javac-init-no-bootclasspath-prepend: Trying to override old definition of task nb-javac

parsing.lucene.default.init: Updating property file:
/space/workspace/push-web-main/nbbuild/netbeans/moduleCluster.properties

parsing.lucene.build-init: Loading module list from /tmp/nb-scan-cache-bf013985-standard.ser

parsing.lucene.-javac-init-no-bootclasspath-prepend: Trying to override old definition of task nb-javac

parsing.lucene.projectized-common.do-unit-test-build: Cannot handle -source 1.7 from this VM; forking null

editor.mimelookup.default.init: Updating property file:
/space/workspace/push-web-main/nbbuild/netbeans/moduleCluster.properties

editor.mimelookup.build-init: Loading module list from /tmp/nb-scan-cache-bf013985-standard.ser

editor.mimelookup.-javac-init-no-bootclasspath-prepend: Trying to override old definition of task nb-javac

editor.mimelookup.projectized-common.do-unit-test-build: Cannot handle -source 1.7 from this VM; forking null

openide.util.ui.default.init: Updating property file:
/space/workspace/push-web-main/nbbuild/netbeans/moduleCluster.properties

openide.util.ui.build-init: Loading module list from /tmp/nb-scan-cache-bf013985-standard.ser

openide.util.ui.-javac-init-no-bootclasspath-prepend: Trying to override old definition of task nb-javac

parsing.api.default.init: Updating property file:
/space/workspace/push-web-main/nbbuild/netbeans/moduleCluster.properties

parsing.api.build-init: Loading module list from /tmp/nb-scan-cache-bf013985-standard.ser

parsing.api.-javac-init-no-bootclasspath-prepend: Trying to override old definition of task nb-javac

parsing.api.projectized-common.do-unit-test-build: Cannot handle -source 1.7 from this VM; forking null Deleting directory
/space/workspace/push-web-main/parsing.api/build/test/unit/data Copying 1 file to /space/workspace/push-web-main/parsing.api/build/test/unit

nbjunit.default.init: Updating property file:
/space/workspace/push-web-main/nbbuild/netbeans/moduleCluster.properties

nbjunit.build-init: Loading module list from /tmp/nb-scan-cache-bf013985-standard.ser

nbjunit.-javac-init-no-bootclasspath-prepend: Trying to override old definition of task nb-javac

parsing.indexing.default.init: Updating property file:
/space/workspace/push-web-main/nbbuild/netbeans/moduleCluster.properties

parsing.indexing.build-init: Loading module list from /tmp/nb-scan-cache-bf013985-standard.ser

parsing.indexing.-javac-init-no-bootclasspath-prepend: Trying to override old definition of task nb-javac

parsing.indexing.projectized-common.do-unit-test-build: Cannot handle -source 1.8 from this VM; forking null Deleting directory
/space/workspace/push-web-main/parsing.indexing/build/test/unit/data Copying 1 file to
/space/workspace/push-web-main/parsing.indexing/build/test/unit

openide.text.default.init: Updating property file:
/space/workspace/push-web-main/nbbuild/netbeans/moduleCluster.properties

openide.text.build-init: Loading module list from /tmp/nb-scan-cache-bf013985-standard.ser

openide.text.-javac-init-no-bootclasspath-prepend: Trying to override old definition of task nb-javac

editor.default.init: Updating property file:
/space/workspace/push-web-main/nbbuild/netbeans/moduleCluster.properties

editor.build-init: Loading module list from /tmp/nb-scan-cache-bf013985-standard.ser

editor.-javac-init-no-bootclasspath-prepend: Trying to override old definition of task nb-javac

editor.projectized-common.do-unit-test-build: Cannot handle -source 1.7 from this VM; forking null

editor.projectized-common.do-qa-functional-test-build: Cannot handle -source 1.7 from this VM; forking null Deleting directory
/space/workspace/push-web-main/editor/build/test/qa-functional/data Copying 176 files to
/space/workspace/push-web-main/editor/build/test/qa-functional

parsing.nb.default.init: Updating property file:
/space/workspace/push-web-main/nbbuild/netbeans/moduleCluster.properties

parsing.nb.build-init: Loading module list from /tmp/nb-scan-cache-bf013985-standard.ser

parsing.nb.-javac-init-no-bootclasspath-prepend: Trying to override old definition of task nb-javac

parsing.nb.projectized-common.do-unit-test-build: Cannot handle -source 1.7 from this VM; forking null Deleting directory
/space/workspace/push-web-main/parsing.nb/build/test/unit/data Copying 1 file to /space/workspace/push-web-main/parsing.nb/build/test/unit

java.source.base.default.init: Updating property file:
/space/workspace/push-web-main/nbbuild/netbeans/moduleCluster.properties

java.source.base.build-init: Loading module list from /tmp/nb-scan-cache-bf013985-standard.ser

BUILD FAILED /space/workspace/push-web-main/nbbuild/build.xml:1422: The following error
occurred while executing this line: /space/workspace/push-web-main/nbbuild/templates/common.xml:605: The following
error occurred while executing this line: /space/workspace/push-web-main/nbbuild/templates/common.xml:598: The following
error occurred while executing this line: /space/workspace/push-web-main/nbbuild/templates/common.xml:652: The following
error occurred while executing this line: /space/workspace/push-web-main/nbbuild/templates/common.xml:624:
java.lang.ClassFormatError: Invalid Constant Pool entry Type 18 at
org.apache.tools.ant.taskdefs.optional.depend.constantpool.ConstantPoolEntry.readEntry(ConstantPoolEntry.java:159) at
org.apache.tools.ant.taskdefs.optional.depend.constantpool.ConstantPool.read(ConstantPool.java:67) at
org.apache.tools.ant.taskdefs.optional.depend.ClassFile.read(ClassFile.java:72) at
org.apache.tools.ant.taskdefs.optional.depend.AntAnalyzer.determineDependencies(AntAnalyzer.java:92) at
org.apache.tools.ant.util.depend.AbstractAnalyzer.getClassDependencies(AbstractAnalyzer.java:100) at
org.apache.tools.ant.taskdefs.optional.depend.Depend.determineDependencies(Depend.java:346) at
org.apache.tools.ant.taskdefs.optional.depend.Depend.execute(Depend.java:718) at org.apache.tools.ant.UnknownElement.execute(UnknownElement.java:291) at sun.reflect.GeneratedMethodAccessor4.invoke(Unknown Source) at
sun.reflect.DelegatingMethodAccessorImpl.invoke(DelegatingMethodAccessorImpl.java:43) at java.lang.reflect.Method.invoke(Method.java:497) at org.apache.tools.ant.dispatch.DispatchUtils.execute(DispatchUtils.java:106) at org.apache.tools.ant.Task.perform(Task.java:348) at org.apache.tools.ant.taskdefs.Sequential.execute(Sequential.java:68) at org.apache.tools.ant.UnknownElement.execute(UnknownElement.java:291) at sun.reflect.GeneratedMethodAccessor4.invoke(Unknown Source) at
sun.reflect.DelegatingMethodAccessorImpl.invoke(DelegatingMethodAccessorImpl.java:43) at java.lang.reflect.Method.invoke(Method.java:497) at org.apache.tools.ant.dispatch.DispatchUtils.execute(DispatchUtils.java:106) at org.apache.tools.ant.Task.perform(Task.java:348) at org.apache.tools.ant.taskdefs.MacroInstance.execute(MacroInstance.java:398) at org.apache.tools.ant.UnknownElement.execute(UnknownElement.java:291) at sun.reflect.GeneratedMethodAccessor4.invoke(Unknown Source) at
sun.reflect.DelegatingMethodAccessorImpl.invoke(DelegatingMethodAccessorImpl.java:43) at java.lang.reflect.Method.invoke(Method.java:497) at org.apache.tools.ant.dispatch.DispatchUtils.execute(DispatchUtils.java:106) at org.apache.tools.ant.Task.perform(Task.java:348) at org.apache.tools.ant.Target.execute(Target.java:390) at org.apache.tools.ant.Target.performTasks(Target.java:411) at org.apache.tools.ant.Project.executeSortedTargets(Project.java:1397) at
org.apache.tools.ant.helper.SingleCheckExecutor.executeTargets(SingleCheckExecutor.java:38) at org.apache.tools.ant.Project.executeTargets(Project.java:1249) at org.apache.tools.ant.taskdefs.Ant.execute(Ant.java:442) at org.apache.tools.ant.taskdefs.SubAnt.execute(SubAnt.java:302) at org.apache.tools.ant.taskdefs.SubAnt.execute(SubAnt.java:221) at org.apache.tools.ant.UnknownElement.execute(UnknownElement.java:291) at sun.reflect.GeneratedMethodAccessor4.invoke(Unknown Source) at
sun.reflect.DelegatingMethodAccessorImpl.invoke(DelegatingMethodAccessorImpl.java:43) at java.lang.reflect.Method.invoke(Method.java:497) at org.apache.tools.ant.dispatch.DispatchUtils.execute(DispatchUtils.java:106) at org.apache.tools.ant.Task.perform(Task.java:348) at org.apache.tools.ant.taskdefs.Sequential.execute(Sequential.java:68) at org.apache.tools.ant.UnknownElement.execute(UnknownElement.java:291) at sun.reflect.GeneratedMethodAccessor4.invoke(Unknown Source) at
sun.reflect.DelegatingMethodAccessorImpl.invoke(DelegatingMethodAccessorImpl.java:43) at java.lang.reflect.Method.invoke(Method.java:497) at org.apache.tools.ant.dispatch.DispatchUtils.execute(DispatchUtils.java:106) at org.apache.tools.ant.Task.perform(Task.java:348) at org.apache.tools.ant.taskdefs.MacroInstance.execute(MacroInstance.java:398) at org.apache.tools.ant.UnknownElement.execute(UnknownElement.java:291) at sun.reflect.GeneratedMethodAccessor4.invoke(Unknown Source) at
sun.reflect.DelegatingMethodAccessorImpl.invoke(DelegatingMethodAccessorImpl.java:43) at java.lang.reflect.Method.invoke(Method.java:497) at org.apache.tools.ant.dispatch.DispatchUtils.execute(DispatchUtils.java:106) at org.apache.tools.ant.Task.perform(Task.java:348) at org.apache.tools.ant.Target.execute(Target.java:390) at org.apache.tools.ant.Target.performTasks(Target.java:411) at org.apache.tools.ant.Project.executeSortedTargets(Project.java:1397) at
org.apache.tools.ant.helper.SingleCheckExecutor.executeTargets(SingleCheckExecutor.java:38) at org.apache.tools.ant.Project.executeTargets(Project.java:1249) at org.apache.tools.ant.taskdefs.Ant.execute(Ant.java:442) at org.apache.tools.ant.taskdefs.SubAnt.execute(SubAnt.java:302) at org.apache.tools.ant.taskdefs.SubAnt.execute(SubAnt.java:221) at org.apache.tools.ant.UnknownElement.execute(UnknownElement.java:291) at sun.reflect.GeneratedMethodAccessor4.invoke(Unknown Source) at
sun.reflect.DelegatingMethodAccessorImpl.invoke(DelegatingMethodAccessorImpl.java:43) at java.lang.reflect.Method.invoke(Method.java:497) at org.apache.tools.ant.dispatch.DispatchUtils.execute(DispatchUtils.java:106) at org.apache.tools.ant.Task.perform(Task.java:348) at org.apache.tools.ant.Target.execute(Target.java:390) at org.apache.tools.ant.Target.performTasks(Target.java:411) at org.apache.tools.ant.Project.executeSortedTargets(Project.java:1397) at org.apache.tools.ant.Project.executeTarget(Project.java:1366) at
org.apache.tools.ant.helper.DefaultExecutor.executeTargets(DefaultExecutor.java:41) at org.apache.tools.ant.Project.executeTargets(Project.java:1249) at org.apache.tools.ant.Main.runBuild(Main.java:801) at org.apache.tools.ant.Main.startAnt(Main.java:218) at org.apache.tools.ant.launch.Launcher.run(Launcher.java:280) at org.apache.tools.ant.launch.Launcher.main(Launcher.java:109)

Total time: 3 minutes 25 seconds Script failed with exitcode 3 rolling back to
13a2a01baffdf2b444fae22c9ecb7386ccf03f57 0 files updated, 0 files merged, 0 files removed, 0 files unresolved 108 files updated, 0 files merged, 12 files removed, 0 files unresolved saving bundle to
/space/workspace/push-web-main/.hg/strip-backup/13a2a01baffd-temp adding branch adding changesets adding manifests adding file changes added 3 changesets with 4 changes to 4 files (-1 heads) pulling from http://hg.netbeans.org/main-silver/ searching for changes adding changesets adding manifests adding file changes added 1 changesets with 0 changes to 0 files (run 'hg update' to get a working copy) Terminating xvnc. $ vncserver -kill :15 Killing Xvnc process ID 9099 Recording test results Archiving artifacts Email was triggered for: Failure Sending email for trigger: Failure