atom feed1 message in org.apache.tuscany.commitsBuild failed in Hudson: Tuscany-2x » ...
FromSent OnAttachments
Apache Hudson ServerDec 10, 2010 1:33 pm 
Subject:Build failed in Hudson: Tuscany-2x » Apache Tuscany SCA iTest JMS Message Format jmsbytes #15
From:Apache Hudson Server (hud@hudson.apache.org)
Date:Dec 10, 2010 1:33:39 pm
List:org.apache.tuscany.commits

See
<https://hudson.apache.org/hudson/job/Tuscany-2x/org.apache.tuscany.sca$itest-jms-format-jmsbytes/15/>

------------------------------------------ [INFO] ------------------------------------------------------------------------ [INFO] Building Apache Tuscany SCA iTest JMS Message Format jmsbytes [INFO] task-segment: [clean, install] [INFO] ------------------------------------------------------------------------ [INFO] [clean:clean] [INFO] [enforcer:enforce {execution: enforce-plugin-versions}] [INFO] [remote-resources:process {execution: default}] [INFO] [resources:resources] [INFO] Using 'UTF-8' encoding to copy filtered resources. [INFO] Copying 3 resources [INFO] Copying 0 resource [INFO] Copying 3 resources [INFO] [compiler:compile] [INFO] Compiling 6 source files to
<https://hudson.apache.org/hudson/job/Tuscany-2x/org.apache.tuscany.sca$itest-jms-format-jmsbytes/ws/target/classes> [INFO] ------------------------------------------------------------- [ERROR] COMPILATION ERROR : [INFO] ------------------------------------------------------------- [ERROR]
<https://hudson.apache.org/hudson/job/Tuscany-2x/org.apache.tuscany.sca$itest-jms-format-jmsbytes/ws/src/main/java/org/apache/tuscany/sca/binding/jms/format/jmsbytes/helloworld/HelloWorldService.java>:[21,35]
package org.oasisopen.sca.annotation does not exist

[ERROR]
<https://hudson.apache.org/hudson/job/Tuscany-2x/org.apache.tuscany.sca$itest-jms-format-jmsbytes/ws/src/main/java/org/apache/tuscany/sca/binding/jms/format/jmsbytes/helloworld/HelloWorldService.java>:[26,1]
cannot find symbol symbol: class Remotable @Remotable

[ERROR]
<https://hudson.apache.org/hudson/job/Tuscany-2x/org.apache.tuscany.sca$itest-jms-format-jmsbytes/ws/src/main/java/org/apache/tuscany/sca/binding/jms/format/jmsbytes/helloworld/HelloWorldServiceReference.java>:[21,35]
package org.oasisopen.sca.annotation does not exist

[ERROR]
<https://hudson.apache.org/hudson/job/Tuscany-2x/org.apache.tuscany.sca$itest-jms-format-jmsbytes/ws/src/main/java/org/apache/tuscany/sca/binding/jms/format/jmsbytes/helloworld/HelloWorldServiceReference.java>:[26,1]
cannot find symbol symbol: class Remotable @Remotable

[ERROR]
<https://hudson.apache.org/hudson/job/Tuscany-2x/org.apache.tuscany.sca$itest-jms-format-jmsbytes/ws/src/main/java/org/apache/tuscany/sca/binding/jms/format/jmsbytes/helloworld/HelloWorldReferenceImpl.java>:[21,35]
package org.oasisopen.sca.annotation does not exist

[ERROR]
<https://hudson.apache.org/hudson/job/Tuscany-2x/org.apache.tuscany.sca$itest-jms-format-jmsbytes/ws/src/main/java/org/apache/tuscany/sca/binding/jms/format/jmsbytes/helloworld/HelloWorldReference.java>:[21,35]
package org.oasisopen.sca.annotation does not exist

[ERROR]
<https://hudson.apache.org/hudson/job/Tuscany-2x/org.apache.tuscany.sca$itest-jms-format-jmsbytes/ws/src/main/java/org/apache/tuscany/sca/binding/jms/format/jmsbytes/helloworld/HelloWorldReference.java>:[26,1]
cannot find symbol symbol: class Remotable @Remotable

[ERROR]
<https://hudson.apache.org/hudson/job/Tuscany-2x/org.apache.tuscany.sca$itest-jms-format-jmsbytes/ws/src/main/java/org/apache/tuscany/sca/binding/jms/format/jmsbytes/helloworld/HelloWorldReferenceImpl.java>:[26,5]
cannot find symbol symbol : class Reference location: class
org.apache.tuscany.sca.binding.jms.format.jmsbytes.helloworld.HelloWorldReferenceImpl

[INFO] 8 errors [INFO] ------------------------------------------------------------- [HUDSON] Archiving disabled - not archiving
<https://hudson.apache.org/hudson/job/Tuscany-2x/org.apache.tuscany.sca$itest-jms-format-jmsbytes/ws/pom.xml>