atom feed1 message in org.apache.tuscany.commitsBuild failed in Hudson: Tuscany-2x » ...
FromSent OnAttachments
Apache Hudson ServerDec 12, 2010 2:25 am 
Subject:Build failed in Hudson: Tuscany-2x » Apache Tuscany SCA iTest WS Contribution Callback Forward Bindings Specified #18
From:Apache Hudson Server (hud@hudson.apache.org)
Date:Dec 12, 2010 2:25:07 am
List:org.apache.tuscany.commits

See
<https://hudson.apache.org/hudson/job/Tuscany-2x/org.apache.tuscany.sca$itest-ws-contribution-callback-forwardspec/18/>

------------------------------------------ [INFO] ------------------------------------------------------------------------ [INFO] Building Apache Tuscany SCA iTest WS Contribution Callback Forward
Bindings Specified [INFO] task-segment: [clean, install] [INFO] ------------------------------------------------------------------------ [INFO] [clean:clean] [INFO] [enforcer:enforce {execution: enforce-plugin-versions}] [INFO] [build-helper:add-test-source {execution: add-source}] [INFO] Test Source directory:
<https://hudson.apache.org/hudson/job/Tuscany-2x/org.apache.tuscany.sca$itest-ws-contribution-callback-forwardspec/ws/target/jaxws-source>
added. [INFO] [remote-resources:process {execution: default}] [INFO] [resources:resources] [INFO] Using 'UTF-8' encoding to copy filtered resources. [INFO] Copying 4 resources [INFO] Copying 0 resource [INFO] Copying 3 resources [INFO] [jaxws:wsimport {execution: wsimport1}] [INFO] Processing:
<https://hudson.apache.org/hudson/job/Tuscany-2x/org.apache.tuscany.sca$itest-ws-contribution-callback-forwardspec/ws/target/classes/helloworld-external-service.wsdl> [INFO] jaxws:wsimport args: [-s,
<https://hudson.apache.org/hudson/job/Tuscany-2x/org.apache.tuscany.sca$itest-ws-contribution-callback-forwardspec/ws/target/jaxws-source,>
-d,
<https://hudson.apache.org/hudson/job/Tuscany-2x/org.apache.tuscany.sca$itest-ws-contribution-callback-forwardspec/ws/target/classes,>
-verbose, -p, org.apache.tuscany.sca.binding.ws.jaxws.external.service.iface,
-target, 2.1, -Xnocompile,
<https://hudson.apache.org/hudson/job/Tuscany-2x/org.apache.tuscany.sca$itest-ws-contribution-callback-forwardspec/ws/target/classes/helloworld-external-service.wsdl]> parsing WSDL...

generating code...

org/apache/tuscany/sca/binding/ws/jaxws/external/service/iface/Bar.java org/apache/tuscany/sca/binding/ws/jaxws/external/service/iface/Foo.java org/apache/tuscany/sca/binding/ws/jaxws/external/service/iface/GetGreetings.java org/apache/tuscany/sca/binding/ws/jaxws/external/service/iface/GetGreetingsComplex.java org/apache/tuscany/sca/binding/ws/jaxws/external/service/iface/GetGreetingsComplexResponse.java org/apache/tuscany/sca/binding/ws/jaxws/external/service/iface/GetGreetingsResponse.java org/apache/tuscany/sca/binding/ws/jaxws/external/service/iface/HelloWorldService.java org/apache/tuscany/sca/binding/ws/jaxws/external/service/iface/HelloWorldServiceService.java org/apache/tuscany/sca/binding/ws/jaxws/external/service/iface/ObjectFactory.java org/apache/tuscany/sca/binding/ws/jaxws/external/service/iface/package-info.java [INFO] [compiler:compile] [INFO] Compiling 15 source files to
<https://hudson.apache.org/hudson/job/Tuscany-2x/org.apache.tuscany.sca$itest-ws-contribution-callback-forwardspec/ws/target/classes> [INFO] ------------------------------------------------------------- [ERROR] COMPILATION ERROR : [INFO] ------------------------------------------------------------- [ERROR]
<https://hudson.apache.org/hudson/job/Tuscany-2x/org.apache.tuscany.sca$itest-ws-contribution-callback-forwardspec/ws/src/main/java/org/apache/tuscany/sca/binding/ws/HelloWorldCallbackService.java>:[23,24]
package org.oasisopen.sca does not exist

[ERROR]
<https://hudson.apache.org/hudson/job/Tuscany-2x/org.apache.tuscany.sca$itest-ws-contribution-callback-forwardspec/ws/src/main/java/org/apache/tuscany/sca/binding/ws/HelloWorldCallbackService.java>:[24,35]
package org.oasisopen.sca.annotation does not exist

[ERROR]
<https://hudson.apache.org/hudson/job/Tuscany-2x/org.apache.tuscany.sca$itest-ws-contribution-callback-forwardspec/ws/src/main/java/org/apache/tuscany/sca/binding/ws/HelloWorldCallbackService.java>:[25,35]
package org.oasisopen.sca.annotation does not exist

[ERROR]
<https://hudson.apache.org/hudson/job/Tuscany-2x/org.apache.tuscany.sca$itest-ws-contribution-callback-forwardspec/ws/src/main/java/org/apache/tuscany/sca/binding/ws/HelloWorldCallbackService.java>:[27,1]
cannot find symbol symbol: class Remotable @Remotable

[ERROR]
<https://hudson.apache.org/hudson/job/Tuscany-2x/org.apache.tuscany.sca$itest-ws-contribution-callback-forwardspec/ws/src/main/java/org/apache/tuscany/sca/binding/ws/HelloWorldCallbackService.java>:[28,1]
cannot find symbol symbol: class Callback @Callback(HelloWorldCallback.class)

[ERROR]
<https://hudson.apache.org/hudson/job/Tuscany-2x/org.apache.tuscany.sca$itest-ws-contribution-callback-forwardspec/ws/src/main/java/org/apache/tuscany/sca/binding/ws/HelloWorldCallbackService.java>:[32,50]
cannot find symbol symbol : class ServiceRuntimeException location: interface org.apache.tuscany.sca.binding.ws.HelloWorldCallbackService

[ERROR]
<https://hudson.apache.org/hudson/job/Tuscany-2x/org.apache.tuscany.sca$itest-ws-contribution-callback-forwardspec/ws/src/main/java/org/apache/tuscany/sca/binding/ws/HelloWorldCallback.java>:[23,35]
package org.oasisopen.sca.annotation does not exist

[ERROR]
<https://hudson.apache.org/hudson/job/Tuscany-2x/org.apache.tuscany.sca$itest-ws-contribution-callback-forwardspec/ws/src/main/java/org/apache/tuscany/sca/binding/ws/HelloWorldCallback.java>:[25,1]
cannot find symbol symbol: class Remotable @Remotable

[ERROR]
<https://hudson.apache.org/hudson/job/Tuscany-2x/org.apache.tuscany.sca$itest-ws-contribution-callback-forwardspec/ws/src/main/java/org/apache/tuscany/sca/binding/ws/HelloWorldCallbackServiceImpl.java>:[23,24]
package org.oasisopen.sca does not exist

[ERROR]
<https://hudson.apache.org/hudson/job/Tuscany-2x/org.apache.tuscany.sca$itest-ws-contribution-callback-forwardspec/ws/src/main/java/org/apache/tuscany/sca/binding/ws/HelloWorldCallbackServiceImpl.java>:[24,35]
package org.oasisopen.sca.annotation does not exist

[ERROR]
<https://hudson.apache.org/hudson/job/Tuscany-2x/org.apache.tuscany.sca$itest-ws-contribution-callback-forwardspec/ws/src/main/java/org/apache/tuscany/sca/binding/ws/HelloWorldCallbackServiceImpl.java>:[25,35]
package org.oasisopen.sca.annotation does not exist

[ERROR]
<https://hudson.apache.org/hudson/job/Tuscany-2x/org.apache.tuscany.sca$itest-ws-contribution-callback-forwardspec/ws/src/main/java/org/apache/tuscany/sca/binding/ws/HelloWorldCallbackServiceImpl.java>:[27,1]
cannot find symbol symbol: class Service @Service(HelloWorldCallbackService.class)

[ERROR]
<https://hudson.apache.org/hudson/job/Tuscany-2x/org.apache.tuscany.sca$itest-ws-contribution-callback-forwardspec/ws/src/main/java/org/apache/tuscany/sca/binding/ws/HelloWorldCallbackServiceImpl.java>:[40,57]
cannot find symbol symbol : class ServiceRuntimeException location: class org.apache.tuscany.sca.binding.ws.HelloWorldCallbackServiceImpl

[ERROR]
<https://hudson.apache.org/hudson/job/Tuscany-2x/org.apache.tuscany.sca$itest-ws-contribution-callback-forwardspec/ws/src/main/java/org/apache/tuscany/sca/binding/ws/HelloWorld.java>:[23,24]
package org.oasisopen.sca does not exist

[ERROR]
<https://hudson.apache.org/hudson/job/Tuscany-2x/org.apache.tuscany.sca$itest-ws-contribution-callback-forwardspec/ws/src/main/java/org/apache/tuscany/sca/binding/ws/HelloWorld.java>:[24,35]
package org.oasisopen.sca.annotation does not exist

[ERROR]
<https://hudson.apache.org/hudson/job/Tuscany-2x/org.apache.tuscany.sca$itest-ws-contribution-callback-forwardspec/ws/src/main/java/org/apache/tuscany/sca/binding/ws/HelloWorld.java>:[26,1]
cannot find symbol symbol: class Remotable @Remotable

[ERROR]
<https://hudson.apache.org/hudson/job/Tuscany-2x/org.apache.tuscany.sca$itest-ws-contribution-callback-forwardspec/ws/src/main/java/org/apache/tuscany/sca/binding/ws/HelloWorld.java>:[30,50]
cannot find symbol symbol : class ServiceRuntimeException location: interface org.apache.tuscany.sca.binding.ws.HelloWorld

[ERROR]
<https://hudson.apache.org/hudson/job/Tuscany-2x/org.apache.tuscany.sca$itest-ws-contribution-callback-forwardspec/ws/src/main/java/org/apache/tuscany/sca/binding/ws/HelloWorldImpl.java>:[26,24]
package org.oasisopen.sca does not exist

[ERROR]
<https://hudson.apache.org/hudson/job/Tuscany-2x/org.apache.tuscany.sca$itest-ws-contribution-callback-forwardspec/ws/src/main/java/org/apache/tuscany/sca/binding/ws/HelloWorldImpl.java>:[27,35]
package org.oasisopen.sca.annotation does not exist

[ERROR]
<https://hudson.apache.org/hudson/job/Tuscany-2x/org.apache.tuscany.sca$itest-ws-contribution-callback-forwardspec/ws/src/main/java/org/apache/tuscany/sca/binding/ws/HelloWorldImpl.java>:[47,57]
cannot find symbol symbol : class ServiceRuntimeException location: class org.apache.tuscany.sca.binding.ws.HelloWorldImpl

[ERROR]
<https://hudson.apache.org/hudson/job/Tuscany-2x/org.apache.tuscany.sca$itest-ws-contribution-callback-forwardspec/ws/src/main/java/org/apache/tuscany/sca/binding/ws/HelloWorldImpl.java>:[70,65]
cannot find symbol symbol : class ServiceRuntimeException location: class org.apache.tuscany.sca.binding.ws.HelloWorldImpl

[ERROR]
<https://hudson.apache.org/hudson/job/Tuscany-2x/org.apache.tuscany.sca$itest-ws-contribution-callback-forwardspec/ws/src/main/java/org/apache/tuscany/sca/binding/ws/HelloWorldCallbackServiceImpl.java>:[30,5]
cannot find symbol symbol : class Callback location: class org.apache.tuscany.sca.binding.ws.HelloWorldCallbackServiceImpl

[ERROR]
<https://hudson.apache.org/hudson/job/Tuscany-2x/org.apache.tuscany.sca$itest-ws-contribution-callback-forwardspec/ws/src/main/java/org/apache/tuscany/sca/binding/ws/HelloWorldImpl.java>:[32,5]
cannot find symbol symbol : class Reference location: class org.apache.tuscany.sca.binding.ws.HelloWorldImpl

[ERROR]
<https://hudson.apache.org/hudson/job/Tuscany-2x/org.apache.tuscany.sca$itest-ws-contribution-callback-forwardspec/ws/src/main/java/org/apache/tuscany/sca/binding/ws/HelloWorldImpl.java>:[35,5]
cannot find symbol symbol : class Reference location: class org.apache.tuscany.sca.binding.ws.HelloWorldImpl

[ERROR]
<https://hudson.apache.org/hudson/job/Tuscany-2x/org.apache.tuscany.sca$itest-ws-contribution-callback-forwardspec/ws/src/main/java/org/apache/tuscany/sca/binding/ws/HelloWorldCallbackServiceImpl.java>:[44,18]
cannot find symbol symbol : class ServiceRuntimeException location: class org.apache.tuscany.sca.binding.ws.HelloWorldCallbackServiceImpl

[ERROR]
<https://hudson.apache.org/hudson/job/Tuscany-2x/org.apache.tuscany.sca$itest-ws-contribution-callback-forwardspec/ws/src/main/java/org/apache/tuscany/sca/binding/ws/HelloWorldImpl.java>:[51,18]
cannot find symbol symbol : class ServiceRuntimeException location: class org.apache.tuscany.sca.binding.ws.HelloWorldImpl

[ERROR]
<https://hudson.apache.org/hudson/job/Tuscany-2x/org.apache.tuscany.sca$itest-ws-contribution-callback-forwardspec/ws/src/main/java/org/apache/tuscany/sca/binding/ws/HelloWorldImpl.java>:[74,18]
cannot find symbol symbol : class ServiceRuntimeException location: class org.apache.tuscany.sca.binding.ws.HelloWorldImpl

[INFO] 27 errors [INFO] ------------------------------------------------------------- [HUDSON] Archiving disabled - not archiving
<https://hudson.apache.org/hudson/job/Tuscany-2x/org.apache.tuscany.sca$itest-ws-contribution-callback-forwardspec/ws/pom.xml>