atom feed1 message in org.apache.tuscany.commitsBuild failed in Hudson: Tuscany-2x » ...
FromSent OnAttachments
Apache Hudson ServerDec 10, 2010 1:33 pm 
Subject:Build failed in Hudson: Tuscany-2x » Apache Tuscany Async Integration Tests #15
From:Apache Hudson Server (hud@hudson.apache.org)
Date:Dec 10, 2010 1:33:39 pm
List:org.apache.tuscany.commits

See
<https://hudson.apache.org/hudson/job/Tuscany-2x/org.apache.tuscany.sca$itest-async-integrations/15/>

------------------------------------------ [INFO] ------------------------------------------------------------------------ [INFO] Building Apache Tuscany Async Integration Tests [INFO] task-segment: [clean, install] [INFO] ------------------------------------------------------------------------ Downloading:
http://people.apache.org/repo/m2-ibiblio-rsync-repository/org/codehaus/mojo/build-helper-maven-plugin/1.5/build-helper-maven-plugin-1.5.pom Downloading:
http://people.apache.org/repo/m2-incubating-repository/org/codehaus/mojo/build-helper-maven-plugin/1.5/build-helper-maven-plugin-1.5.pom Downloading:
http://repository.apache.org/snapshots/org/codehaus/mojo/build-helper-maven-plugin/1.5/build-helper-maven-plugin-1.5.pom Downloading:
http://repo2.maven.org/maven2/org/codehaus/mojo/build-helper-maven-plugin/1.5/build-helper-maven-plugin-1.5.pom Downloading:
http://people.apache.org/repo/m2-ibiblio-rsync-repository/org/codehaus/mojo/mojo-parent/23/mojo-parent-23.pom Downloading:
http://people.apache.org/repo/m2-incubating-repository/org/codehaus/mojo/mojo-parent/23/mojo-parent-23.pom Downloading:
http://repository.apache.org/snapshots/org/codehaus/mojo/mojo-parent/23/mojo-parent-23.pom Downloading:
http://repo2.maven.org/maven2/org/codehaus/mojo/mojo-parent/23/mojo-parent-23.pom Downloading:
http://people.apache.org/repo/m2-ibiblio-rsync-repository/org/codehaus/mojo/build-helper-maven-plugin/1.5/build-helper-maven-plugin-1.5.jar Downloading:
http://people.apache.org/repo/m2-incubating-repository/org/codehaus/mojo/build-helper-maven-plugin/1.5/build-helper-maven-plugin-1.5.jar Downloading:
http://repository.apache.org/snapshots/org/codehaus/mojo/build-helper-maven-plugin/1.5/build-helper-maven-plugin-1.5.jar Downloading:
http://repo2.maven.org/maven2/org/codehaus/mojo/build-helper-maven-plugin/1.5/build-helper-maven-plugin-1.5.jar [INFO] Reloading plugin container for:
org.codehaus.mojo:build-helper-maven-plugin. The plugin artifact has changed. [INFO] [clean:clean] [INFO] [enforcer:enforce {execution: enforce-plugin-versions}] Downloading:
http://people.apache.org/repo/m2-ibiblio-rsync-repository/org/apache/maven/maven-core/2.0.2/maven-core-2.0.2.pom Downloading:
http://people.apache.org/repo/m2-incubating-repository/org/apache/maven/maven-core/2.0.2/maven-core-2.0.2.pom Downloading:
http://repository.apache.org/snapshots/org/apache/maven/maven-core/2.0.2/maven-core-2.0.2.pom Downloading:
http://repo2.maven.org/maven2/org/apache/maven/maven-core/2.0.2/maven-core-2.0.2.pom Downloading:
http://people.apache.org/repo/m2-ibiblio-rsync-repository/org/apache/maven/maven-settings/2.0.2/maven-settings-2.0.2.pom Downloading:
http://people.apache.org/repo/m2-incubating-repository/org/apache/maven/maven-settings/2.0.2/maven-settings-2.0.2.pom Downloading:
http://repository.apache.org/snapshots/org/apache/maven/maven-settings/2.0.2/maven-settings-2.0.2.pom Downloading:
http://repo2.maven.org/maven2/org/apache/maven/maven-settings/2.0.2/maven-settings-2.0.2.pom Downloading:
http://people.apache.org/repo/m2-ibiblio-rsync-repository/org/apache/maven/wagon/wagon-file/1.0-alpha-6/wagon-file-1.0-alpha-6.pom Downloading:
http://people.apache.org/repo/m2-incubating-repository/org/apache/maven/wagon/wagon-file/1.0-alpha-6/wagon-file-1.0-alpha-6.pom Downloading:
http://repository.apache.org/snapshots/org/apache/maven/wagon/wagon-file/1.0-alpha-6/wagon-file-1.0-alpha-6.pom Downloading:
http://repo2.maven.org/maven2/org/apache/maven/wagon/wagon-file/1.0-alpha-6/wagon-file-1.0-alpha-6.pom Downloading:
http://people.apache.org/repo/m2-ibiblio-rsync-repository/org/apache/maven/wagon/wagon-providers/1.0-alpha-6/wagon-providers-1.0-alpha-6.pom Downloading:
http://people.apache.org/repo/m2-incubating-repository/org/apache/maven/wagon/wagon-providers/1.0-alpha-6/wagon-providers-1.0-alpha-6.pom Downloading:
http://repository.apache.org/snapshots/org/apache/maven/wagon/wagon-providers/1.0-alpha-6/wagon-providers-1.0-alpha-6.pom Downloading:
http://repo2.maven.org/maven2/org/apache/maven/wagon/wagon-providers/1.0-alpha-6/wagon-providers-1.0-alpha-6.pom Downloading:
http://people.apache.org/repo/m2-ibiblio-rsync-repository/org/apache/maven/maven-plugin-parameter-documenter/2.0.2/maven-plugin-parameter-documenter-2.0.2.pom Downloading:
http://people.apache.org/repo/m2-incubating-repository/org/apache/maven/maven-plugin-parameter-documenter/2.0.2/maven-plugin-parameter-documenter-2.0.2.pom Downloading:
http://repository.apache.org/snapshots/org/apache/maven/maven-plugin-parameter-documenter/2.0.2/maven-plugin-parameter-documenter-2.0.2.pom Downloading:
http://repo2.maven.org/maven2/org/apache/maven/maven-plugin-parameter-documenter/2.0.2/maven-plugin-parameter-documenter-2.0.2.pom Downloading:
http://people.apache.org/repo/m2-ibiblio-rsync-repository/org/apache/maven/wagon/wagon-http-lightweight/1.0-alpha-6/wagon-http-lightweight-1.0-alpha-6.pom Downloading:
http://people.apache.org/repo/m2-incubating-repository/org/apache/maven/wagon/wagon-http-lightweight/1.0-alpha-6/wagon-http-lightweight-1.0-alpha-6.pom Downloading:
http://repository.apache.org/snapshots/org/apache/maven/wagon/wagon-http-lightweight/1.0-alpha-6/wagon-http-lightweight-1.0-alpha-6.pom Downloading:
http://repo2.maven.org/maven2/org/apache/maven/wagon/wagon-http-lightweight/1.0-alpha-6/wagon-http-lightweight-1.0-alpha-6.pom Downloading:
http://people.apache.org/repo/m2-ibiblio-rsync-repository/org/apache/maven/reporting/maven-reporting-api/2.0.2/maven-reporting-api-2.0.2.pom Downloading:
http://people.apache.org/repo/m2-incubating-repository/org/apache/maven/reporting/maven-reporting-api/2.0.2/maven-reporting-api-2.0.2.pom Downloading:
http://repository.apache.org/snapshots/org/apache/maven/reporting/maven-reporting-api/2.0.2/maven-reporting-api-2.0.2.pom Downloading:
http://repo2.maven.org/maven2/org/apache/maven/reporting/maven-reporting-api/2.0.2/maven-reporting-api-2.0.2.pom Downloading:
http://people.apache.org/repo/m2-ibiblio-rsync-repository/org/apache/maven/reporting/maven-reporting/2.0.2/maven-reporting-2.0.2.pom Downloading:
http://people.apache.org/repo/m2-incubating-repository/org/apache/maven/reporting/maven-reporting/2.0.2/maven-reporting-2.0.2.pom Downloading:
http://repository.apache.org/snapshots/org/apache/maven/reporting/maven-reporting/2.0.2/maven-reporting-2.0.2.pom Downloading:
http://repo2.maven.org/maven2/org/apache/maven/reporting/maven-reporting/2.0.2/maven-reporting-2.0.2.pom Downloading:
http://people.apache.org/repo/m2-ibiblio-rsync-repository/org/apache/maven/maven-error-diagnostics/2.0.2/maven-error-diagnostics-2.0.2.pom Downloading:
http://people.apache.org/repo/m2-incubating-repository/org/apache/maven/maven-error-diagnostics/2.0.2/maven-error-diagnostics-2.0.2.pom Downloading:
http://repository.apache.org/snapshots/org/apache/maven/maven-error-diagnostics/2.0.2/maven-error-diagnostics-2.0.2.pom Downloading:
http://repo2.maven.org/maven2/org/apache/maven/maven-error-diagnostics/2.0.2/maven-error-diagnostics-2.0.2.pom Downloading:
http://people.apache.org/repo/m2-ibiblio-rsync-repository/org/apache/maven/maven-plugin-registry/2.0.2/maven-plugin-registry-2.0.2.pom Downloading:
http://people.apache.org/repo/m2-incubating-repository/org/apache/maven/maven-plugin-registry/2.0.2/maven-plugin-registry-2.0.2.pom Downloading:
http://repository.apache.org/snapshots/org/apache/maven/maven-plugin-registry/2.0.2/maven-plugin-registry-2.0.2.pom Downloading:
http://repo2.maven.org/maven2/org/apache/maven/maven-plugin-registry/2.0.2/maven-plugin-registry-2.0.2.pom Downloading:
http://people.apache.org/repo/m2-ibiblio-rsync-repository/org/apache/maven/wagon/wagon-ssh-external/1.0-alpha-6/wagon-ssh-external-1.0-alpha-6.pom Downloading:
http://people.apache.org/repo/m2-incubating-repository/org/apache/maven/wagon/wagon-ssh-external/1.0-alpha-6/wagon-ssh-external-1.0-alpha-6.pom Downloading:
http://repository.apache.org/snapshots/org/apache/maven/wagon/wagon-ssh-external/1.0-alpha-6/wagon-ssh-external-1.0-alpha-6.pom Downloading:
http://repo2.maven.org/maven2/org/apache/maven/wagon/wagon-ssh-external/1.0-alpha-6/wagon-ssh-external-1.0-alpha-6.pom Downloading:
http://people.apache.org/repo/m2-ibiblio-rsync-repository/org/apache/maven/maven-plugin-descriptor/2.0.2/maven-plugin-descriptor-2.0.2.pom Downloading:
http://people.apache.org/repo/m2-incubating-repository/org/apache/maven/maven-plugin-descriptor/2.0.2/maven-plugin-descriptor-2.0.2.pom Downloading:
http://repository.apache.org/snapshots/org/apache/maven/maven-plugin-descriptor/2.0.2/maven-plugin-descriptor-2.0.2.pom Downloading:
http://repo2.maven.org/maven2/org/apache/maven/maven-plugin-descriptor/2.0.2/maven-plugin-descriptor-2.0.2.pom Downloading:
http://people.apache.org/repo/m2-ibiblio-rsync-repository/org/apache/maven/maven-monitor/2.0.2/maven-monitor-2.0.2.pom Downloading:
http://people.apache.org/repo/m2-incubating-repository/org/apache/maven/maven-monitor/2.0.2/maven-monitor-2.0.2.pom Downloading:
http://repository.apache.org/snapshots/org/apache/maven/maven-monitor/2.0.2/maven-monitor-2.0.2.pom Downloading:
http://repo2.maven.org/maven2/org/apache/maven/maven-monitor/2.0.2/maven-monitor-2.0.2.pom Downloading:
http://people.apache.org/repo/m2-ibiblio-rsync-repository/org/apache/maven/wagon/wagon-ssh/1.0-alpha-6/wagon-ssh-1.0-alpha-6.pom Downloading:
http://people.apache.org/repo/m2-incubating-repository/org/apache/maven/wagon/wagon-ssh/1.0-alpha-6/wagon-ssh-1.0-alpha-6.pom Downloading:
http://repository.apache.org/snapshots/org/apache/maven/wagon/wagon-ssh/1.0-alpha-6/wagon-ssh-1.0-alpha-6.pom Downloading:
http://repo2.maven.org/maven2/org/apache/maven/wagon/wagon-ssh/1.0-alpha-6/wagon-ssh-1.0-alpha-6.pom Downloading:
http://people.apache.org/repo/m2-ibiblio-rsync-repository/com/jcraft/jsch/0.1.24/jsch-0.1.24.pom Downloading:
http://people.apache.org/repo/m2-incubating-repository/com/jcraft/jsch/0.1.24/jsch-0.1.24.pom Downloading:
http://repository.apache.org/snapshots/com/jcraft/jsch/0.1.24/jsch-0.1.24.pom Downloading:
http://repo2.maven.org/maven2/com/jcraft/jsch/0.1.24/jsch-0.1.24.pom Downloading:
http://people.apache.org/repo/m2-ibiblio-rsync-repository/org/apache/maven/maven-plugin-api/2.0.2/maven-plugin-api-2.0.2.pom Downloading:
http://people.apache.org/repo/m2-incubating-repository/org/apache/maven/maven-plugin-api/2.0.2/maven-plugin-api-2.0.2.pom Downloading:
http://repository.apache.org/snapshots/org/apache/maven/maven-plugin-api/2.0.2/maven-plugin-api-2.0.2.pom Downloading:
http://repo2.maven.org/maven2/org/apache/maven/maven-plugin-api/2.0.2/maven-plugin-api-2.0.2.pom [INFO] [build-helper:add-test-source {execution: add-jaxws}] [INFO] Test Source directory:
<https://hudson.apache.org/hudson/job/Tuscany-2x/org.apache.tuscany.sca$itest-async-integrations/ws/target/jaxws-source>
added. [INFO] [jaxws:wsimport {execution: wsimport-client}] [INFO] Processing:
<https://hudson.apache.org/hudson/job/Tuscany-2x/org.apache.tuscany.sca$itest-async-integrations/ws/src/main/resources/wsdl/creditcard.wsdl> [INFO] jaxws:wsimport args: [-s,
<https://hudson.apache.org/hudson/job/Tuscany-2x/org.apache.tuscany.sca$itest-async-integrations/ws/target/jaxws-source,>
-d,
<https://hudson.apache.org/hudson/job/Tuscany-2x/org.apache.tuscany.sca$itest-async-integrations/ws/target/classes,>
-Xnocompile, -B-p, com.example.test.jaxb.client, -b,
<https://hudson.apache.org/hudson/job/Tuscany-2x/org.apache.tuscany.sca$itest-async-integrations/ws/src/main/resources/wsdl/creditcard-client.xml,>
<https://hudson.apache.org/hudson/job/Tuscany-2x/org.apache.tuscany.sca$itest-async-integrations/ws/src/main/resources/wsdl/creditcard.wsdl]> parsing WSDL...

generating code...

[INFO] [jaxws:wsimport {execution: wsimport-server}] [INFO] Processing:
<https://hudson.apache.org/hudson/job/Tuscany-2x/org.apache.tuscany.sca$itest-async-integrations/ws/src/main/resources/wsdl/creditcard.wsdl> [INFO] jaxws:wsimport args: [-s,
<https://hudson.apache.org/hudson/job/Tuscany-2x/org.apache.tuscany.sca$itest-async-integrations/ws/target/jaxws-source,>
-d,
<https://hudson.apache.org/hudson/job/Tuscany-2x/org.apache.tuscany.sca$itest-async-integrations/ws/target/classes,>
-Xnocompile, -B-p, com.example.test.jaxb.server, -b,
<https://hudson.apache.org/hudson/job/Tuscany-2x/org.apache.tuscany.sca$itest-async-integrations/ws/src/main/resources/wsdl/creditcard-server.xml,>
<https://hudson.apache.org/hudson/job/Tuscany-2x/org.apache.tuscany.sca$itest-async-integrations/ws/src/main/resources/wsdl/creditcard.wsdl]> parsing WSDL...

generating code...

[INFO] [remote-resources:process {execution: default}] [INFO] [resources:resources] [INFO] Using 'UTF-8' encoding to copy filtered resources. [INFO] Copying 5 resources [INFO] Copying 0 resource [INFO] Copying 3 resources [INFO] [compiler:compile] [INFO] Compiling 33 source files to
<https://hudson.apache.org/hudson/job/Tuscany-2x/org.apache.tuscany.sca$itest-async-integrations/ws/target/classes> [INFO] ------------------------------------------------------------- [ERROR] COMPILATION ERROR : [INFO] ------------------------------------------------------------- [ERROR]
<https://hudson.apache.org/hudson/job/Tuscany-2x/org.apache.tuscany.sca$itest-async-integrations/ws/src/main/java/test/client/CreditCardPaymentCallbackSync.java>:[21,35]
package org.oasisopen.sca.annotation does not exist

[ERROR]
<https://hudson.apache.org/hudson/job/Tuscany-2x/org.apache.tuscany.sca$itest-async-integrations/ws/src/main/java/test/client/CreditCardPaymentCallbackSync.java>:[26,1]
cannot find symbol symbol: class Remotable @Remotable

[ERROR]
<https://hudson.apache.org/hudson/job/Tuscany-2x/org.apache.tuscany.sca$itest-async-integrations/ws/src/main/java/test/client/CreditCardPaymentClientImpl.java>:[28,35]
package org.oasisopen.sca.annotation does not exist

[ERROR]
<https://hudson.apache.org/hudson/job/Tuscany-2x/org.apache.tuscany.sca$itest-async-integrations/ws/src/main/java/test/client/CreditCardPaymentClientImpl.java>:[29,35]
package org.oasisopen.sca.annotation does not exist

[ERROR]
<https://hudson.apache.org/hudson/job/Tuscany-2x/org.apache.tuscany.sca$itest-async-integrations/ws/src/main/java/test/client/CreditCardPaymentCallback.java>:[21,35]
package org.oasisopen.sca.annotation does not exist

[ERROR]
<https://hudson.apache.org/hudson/job/Tuscany-2x/org.apache.tuscany.sca$itest-async-integrations/ws/src/main/java/test/client/CreditCardPaymentCallback.java>:[22,35]
package org.oasisopen.sca.annotation does not exist

[ERROR]
<https://hudson.apache.org/hudson/job/Tuscany-2x/org.apache.tuscany.sca$itest-async-integrations/ws/src/main/java/test/client/CreditCardPaymentCallback.java>:[27,1]
cannot find symbol symbol: class Remotable @Remotable

[ERROR]
<https://hudson.apache.org/hudson/job/Tuscany-2x/org.apache.tuscany.sca$itest-async-integrations/ws/src/main/java/test/client/CreditCardPaymentClientImpl.java>:[41,1]
cannot find symbol symbol: class Service @Service(CreditCardClient.class)

[ERROR]
<https://hudson.apache.org/hudson/job/Tuscany-2x/org.apache.tuscany.sca$itest-async-integrations/ws/src/main/java/test/client/CreditCardPaymentRequestClient.java>:[22,35]
package org.oasisopen.sca.annotation does not exist

[ERROR]
<https://hudson.apache.org/hudson/job/Tuscany-2x/org.apache.tuscany.sca$itest-async-integrations/ws/src/main/java/test/client/CreditCardPaymentRequestClient.java>:[23,35]
package org.oasisopen.sca.annotation does not exist

[ERROR]
<https://hudson.apache.org/hudson/job/Tuscany-2x/org.apache.tuscany.sca$itest-async-integrations/ws/src/main/java/test/client/CreditCardPaymentRequestClient.java>:[24,35]
package org.oasisopen.sca.annotation does not exist

[ERROR]
<https://hudson.apache.org/hudson/job/Tuscany-2x/org.apache.tuscany.sca$itest-async-integrations/ws/src/main/java/test/client/CreditCardPaymentRequestClient.java>:[31,1]
cannot find symbol symbol: class Remotable @Remotable

[ERROR]
<https://hudson.apache.org/hudson/job/Tuscany-2x/org.apache.tuscany.sca$itest-async-integrations/ws/src/main/java/test/client/CreditCardPaymentRequestClient.java>:[32,1]
cannot find symbol symbol: class Callback @Callback(CreditCardPaymentCallback.class)

[ERROR]
<https://hudson.apache.org/hudson/job/Tuscany-2x/org.apache.tuscany.sca$itest-async-integrations/ws/src/main/java/test/client/CreditCardPaymentRequestClientSync.java>:[22,35]
package org.oasisopen.sca.annotation does not exist

[ERROR]
<https://hudson.apache.org/hudson/job/Tuscany-2x/org.apache.tuscany.sca$itest-async-integrations/ws/src/main/java/test/client/CreditCardPaymentRequestClientSync.java>:[23,35]
package org.oasisopen.sca.annotation does not exist

[ERROR]
<https://hudson.apache.org/hudson/job/Tuscany-2x/org.apache.tuscany.sca$itest-async-integrations/ws/src/main/java/test/client/CreditCardPaymentRequestClientSync.java>:[30,1]
cannot find symbol symbol: class Remotable @Remotable

[ERROR]
<https://hudson.apache.org/hudson/job/Tuscany-2x/org.apache.tuscany.sca$itest-async-integrations/ws/src/main/java/test/client/CreditCardPaymentRequestClientSync.java>:[31,1]
cannot find symbol symbol: class Callback @Callback(CreditCardPaymentCallbackSync.class)

[ERROR]
<https://hudson.apache.org/hudson/job/Tuscany-2x/org.apache.tuscany.sca$itest-async-integrations/ws/src/main/java/test/server/CreditCardPaymentImpl.java>:[22,35]
package org.oasisopen.sca.annotation does not exist

[ERROR]
<https://hudson.apache.org/hudson/job/Tuscany-2x/org.apache.tuscany.sca$itest-async-integrations/ws/src/main/java/test/server/CreditCardPaymentImpl.java>:[23,35]
package org.oasisopen.sca.annotation does not exist

[ERROR]
<https://hudson.apache.org/hudson/job/Tuscany-2x/org.apache.tuscany.sca$itest-async-integrations/ws/src/main/java/test/server/CreditCardPaymentRequestServer.java>:[22,35]
package org.oasisopen.sca.annotation does not exist

[ERROR]
<https://hudson.apache.org/hudson/job/Tuscany-2x/org.apache.tuscany.sca$itest-async-integrations/ws/src/main/java/test/server/CreditCardPaymentRequestServer.java>:[23,35]
package org.oasisopen.sca.annotation does not exist

[ERROR]
<https://hudson.apache.org/hudson/job/Tuscany-2x/org.apache.tuscany.sca$itest-async-integrations/ws/src/main/java/test/server/CreditCardPaymentRequestServer.java>:[24,35]
package org.oasisopen.sca.annotation does not exist

[ERROR]
<https://hudson.apache.org/hudson/job/Tuscany-2x/org.apache.tuscany.sca$itest-async-integrations/ws/src/main/java/test/server/CreditCardPaymentRequestServer.java>:[33,1]
cannot find symbol symbol: class Remotable @Remotable

[ERROR]
<https://hudson.apache.org/hudson/job/Tuscany-2x/org.apache.tuscany.sca$itest-async-integrations/ws/src/main/java/test/server/CreditCardPaymentRequestServer.java>:[34,1]
cannot find symbol symbol: class Callback @Callback(CreditCardPaymentCallback.class)

[ERROR]
<https://hudson.apache.org/hudson/job/Tuscany-2x/org.apache.tuscany.sca$itest-async-integrations/ws/src/main/java/test/server/CreditCardPaymentRequestServerSync.java>:[22,35]
package org.oasisopen.sca.annotation does not exist

[ERROR]
<https://hudson.apache.org/hudson/job/Tuscany-2x/org.apache.tuscany.sca$itest-async-integrations/ws/src/main/java/test/server/CreditCardPaymentRequestServerSync.java>:[23,35]
package org.oasisopen.sca.annotation does not exist

[ERROR]
<https://hudson.apache.org/hudson/job/Tuscany-2x/org.apache.tuscany.sca$itest-async-integrations/ws/src/main/java/test/server/CreditCardPaymentRequestServerSync.java>:[32,1]
cannot find symbol symbol: class Remotable @Remotable

[ERROR]
<https://hudson.apache.org/hudson/job/Tuscany-2x/org.apache.tuscany.sca$itest-async-integrations/ws/src/main/java/test/server/CreditCardPaymentRequestServerSync.java>:[33,1]
cannot find symbol symbol: class Callback @Callback(CreditCardPaymentCallbackSync.class)

[ERROR]
<https://hudson.apache.org/hudson/job/Tuscany-2x/org.apache.tuscany.sca$itest-async-integrations/ws/src/main/java/test/server/CreditCardPaymentImpl.java>:[35,1]
cannot find symbol symbol: class Service @Service({CreditCardPayment.class, CreditCardPaymentRequestServer.class,
CreditCardPaymentRequestServerSync.class})

[ERROR]
<https://hudson.apache.org/hudson/job/Tuscany-2x/org.apache.tuscany.sca$itest-async-integrations/ws/src/main/java/test/client/CreditCardPaymentClientImpl.java>:[45,5]
cannot find symbol symbol : class Reference location: class test.client.CreditCardPaymentClientImpl

[ERROR]
<https://hudson.apache.org/hudson/job/Tuscany-2x/org.apache.tuscany.sca$itest-async-integrations/ws/src/main/java/test/client/CreditCardPaymentClientImpl.java>:[48,5]
cannot find symbol symbol : class Reference location: class test.client.CreditCardPaymentClientImpl

[ERROR]
<https://hudson.apache.org/hudson/job/Tuscany-2x/org.apache.tuscany.sca$itest-async-integrations/ws/src/main/java/test/client/CreditCardPaymentClientImpl.java>:[51,5]
cannot find symbol symbol : class Reference location: class test.client.CreditCardPaymentClientImpl

[ERROR]
<https://hudson.apache.org/hudson/job/Tuscany-2x/org.apache.tuscany.sca$itest-async-integrations/ws/src/main/java/test/client/CreditCardPaymentCallback.java>:[30,5]
cannot find symbol symbol : class OneWay location: interface test.client.CreditCardPaymentCallback

[ERROR]
<https://hudson.apache.org/hudson/job/Tuscany-2x/org.apache.tuscany.sca$itest-async-integrations/ws/src/main/java/test/client/CreditCardPaymentRequestClient.java>:[35,5]
cannot find symbol symbol : class OneWay location: interface test.client.CreditCardPaymentRequestClient

[ERROR]
<https://hudson.apache.org/hudson/job/Tuscany-2x/org.apache.tuscany.sca$itest-async-integrations/ws/src/main/java/test/server/CreditCardPaymentImpl.java>:[38,5]
cannot find symbol symbol : class Callback location: class test.server.CreditCardPaymentImpl

[ERROR]
<https://hudson.apache.org/hudson/job/Tuscany-2x/org.apache.tuscany.sca$itest-async-integrations/ws/src/main/java/test/server/CreditCardPaymentImpl.java>:[41,5]
cannot find symbol symbol : class Callback location: class test.server.CreditCardPaymentImpl

[ERROR]
<https://hudson.apache.org/hudson/job/Tuscany-2x/org.apache.tuscany.sca$itest-async-integrations/ws/src/main/java/test/server/CreditCardPaymentRequestServer.java>:[37,5]
cannot find symbol symbol : class OneWay location: interface test.server.CreditCardPaymentRequestServer

[INFO] 37 errors [INFO] ------------------------------------------------------------- [HUDSON] Archiving disabled - not archiving
<https://hudson.apache.org/hudson/job/Tuscany-2x/org.apache.tuscany.sca$itest-async-integrations/ws/pom.xml>