atom feed1 message in org.apache.tuscany.commitsBuild failed in Hudson: Tuscany-2x » ...
FromSent OnAttachments
Apache Hudson ServerDec 12, 2010 2:25 am 
Subject:Build failed in Hudson: Tuscany-2x » Apache Tuscany SCA Sample Launcher Embedded JSE #18
From:Apache Hudson Server (hud@hudson.apache.org)
Date:Dec 12, 2010 2:25:08 am
List:org.apache.tuscany.commits

See
<https://hudson.apache.org/hudson/job/Tuscany-2x/org.apache.tuscany.sca$sample-launcher-embedded-jse/18/>

------------------------------------------ [INFO] ------------------------------------------------------------------------ [INFO] Building Apache Tuscany SCA Sample Launcher Embedded JSE [INFO] task-segment: [clean, install] [INFO] ------------------------------------------------------------------------ [INFO] [clean:clean] [INFO] [enforcer:enforce {execution: enforce-plugin-versions}] [INFO] [remote-resources:process {execution: default}] [INFO] [resources:resources] [INFO] Using 'UTF-8' encoding to copy filtered resources. [INFO] skip non existing resourceDirectory
<https://hudson.apache.org/hudson/job/Tuscany-2x/org.apache.tuscany.sca$sample-launcher-embedded-jse/ws/src/main/resources> [INFO] Copying 1 resource [INFO] [compiler:compile] [INFO] Compiling 9 source files to
<https://hudson.apache.org/hudson/job/Tuscany-2x/org.apache.tuscany.sca$sample-launcher-embedded-jse/ws/target/classes> [INFO] ------------------------------------------------------------- [ERROR] COMPILATION ERROR : [INFO] ------------------------------------------------------------- [ERROR]
<https://hudson.apache.org/hudson/job/Tuscany-2x/org.apache.tuscany.sca$sample-launcher-embedded-jse/ws/src/main/java/launcher/JSELauncherImplementationScriptCalculator.java>:[22,34]
package org.apache.tuscany.sca.node does not exist

[ERROR]
<https://hudson.apache.org/hudson/job/Tuscany-2x/org.apache.tuscany.sca$sample-launcher-embedded-jse/ws/src/main/java/launcher/JSELauncherImplementationScriptCalculator.java>:[23,34]
package org.apache.tuscany.sca.node does not exist

[ERROR]
<https://hudson.apache.org/hudson/job/Tuscany-2x/org.apache.tuscany.sca$sample-launcher-embedded-jse/ws/src/main/java/launcher/JSELauncherImplementationScriptCalculator.java>:[24,34]
package org.apache.tuscany.sca.node does not exist

[ERROR]
<https://hudson.apache.org/hudson/job/Tuscany-2x/org.apache.tuscany.sca$sample-launcher-embedded-jse/ws/src/main/java/launcher/JSELauncherImplementationJavaCalculatorAsync.java>:[22,34]
package org.apache.tuscany.sca.node does not exist

[ERROR]
<https://hudson.apache.org/hudson/job/Tuscany-2x/org.apache.tuscany.sca$sample-launcher-embedded-jse/ws/src/main/java/launcher/JSELauncherImplementationJavaCalculatorAsync.java>:[23,34]
package org.apache.tuscany.sca.node does not exist

[ERROR]
<https://hudson.apache.org/hudson/job/Tuscany-2x/org.apache.tuscany.sca$sample-launcher-embedded-jse/ws/src/main/java/launcher/JSELauncherImplementationJavaCalculatorAsync.java>:[24,34]
package org.apache.tuscany.sca.node does not exist

[ERROR]
<https://hudson.apache.org/hudson/job/Tuscany-2x/org.apache.tuscany.sca$sample-launcher-embedded-jse/ws/src/main/java/launcher/JSELauncherBindingJSONRPCCalculator.java>:[22,34]
package org.apache.tuscany.sca.node does not exist

[ERROR]
<https://hudson.apache.org/hudson/job/Tuscany-2x/org.apache.tuscany.sca$sample-launcher-embedded-jse/ws/src/main/java/launcher/JSELauncherBindingJSONRPCCalculator.java>:[23,34]
package org.apache.tuscany.sca.node does not exist

[ERROR]
<https://hudson.apache.org/hudson/job/Tuscany-2x/org.apache.tuscany.sca$sample-launcher-embedded-jse/ws/src/main/java/launcher/JSELauncherBindingJSONRPCCalculator.java>:[24,34]
package org.apache.tuscany.sca.node does not exist

[ERROR]
<https://hudson.apache.org/hudson/job/Tuscany-2x/org.apache.tuscany.sca$sample-launcher-embedded-jse/ws/src/main/java/launcher/JSELauncherImplementationJavaCalculator.java>:[22,34]
package org.apache.tuscany.sca.node does not exist

[ERROR]
<https://hudson.apache.org/hudson/job/Tuscany-2x/org.apache.tuscany.sca$sample-launcher-embedded-jse/ws/src/main/java/launcher/JSELauncherImplementationJavaCalculator.java>:[23,34]
package org.apache.tuscany.sca.node does not exist

[ERROR]
<https://hudson.apache.org/hudson/job/Tuscany-2x/org.apache.tuscany.sca$sample-launcher-embedded-jse/ws/src/main/java/launcher/JSELauncherImplementationJavaCalculator.java>:[24,34]
package org.apache.tuscany.sca.node does not exist

[ERROR]
<https://hudson.apache.org/hudson/job/Tuscany-2x/org.apache.tuscany.sca$sample-launcher-embedded-jse/ws/src/main/java/launcher/JSELauncherBindingRMICalculator.java>:[22,34]
package org.apache.tuscany.sca.node does not exist

[ERROR]
<https://hudson.apache.org/hudson/job/Tuscany-2x/org.apache.tuscany.sca$sample-launcher-embedded-jse/ws/src/main/java/launcher/JSELauncherBindingRMICalculator.java>:[23,34]
package org.apache.tuscany.sca.node does not exist

[ERROR]
<https://hudson.apache.org/hudson/job/Tuscany-2x/org.apache.tuscany.sca$sample-launcher-embedded-jse/ws/src/main/java/launcher/JSELauncherBindingRMICalculator.java>:[24,34]
package org.apache.tuscany.sca.node does not exist

[ERROR]
<https://hudson.apache.org/hudson/job/Tuscany-2x/org.apache.tuscany.sca$sample-launcher-embedded-jse/ws/src/main/java/launcher/JSELauncherBindingSCACalculator.java>:[22,34]
package org.apache.tuscany.sca.node does not exist

[ERROR]
<https://hudson.apache.org/hudson/job/Tuscany-2x/org.apache.tuscany.sca$sample-launcher-embedded-jse/ws/src/main/java/launcher/JSELauncherBindingSCACalculator.java>:[23,34]
package org.apache.tuscany.sca.node does not exist

[ERROR]
<https://hudson.apache.org/hudson/job/Tuscany-2x/org.apache.tuscany.sca$sample-launcher-embedded-jse/ws/src/main/java/launcher/JSELauncherBindingSCACalculator.java>:[24,34]
package org.apache.tuscany.sca.node does not exist

[ERROR]
<https://hudson.apache.org/hudson/job/Tuscany-2x/org.apache.tuscany.sca$sample-launcher-embedded-jse/ws/src/main/java/launcher/JSELauncherBindingWSCalculator.java>:[22,34]
package org.apache.tuscany.sca.node does not exist

[ERROR]
<https://hudson.apache.org/hudson/job/Tuscany-2x/org.apache.tuscany.sca$sample-launcher-embedded-jse/ws/src/main/java/launcher/JSELauncherBindingWSCalculator.java>:[23,34]
package org.apache.tuscany.sca.node does not exist

[ERROR]
<https://hudson.apache.org/hudson/job/Tuscany-2x/org.apache.tuscany.sca$sample-launcher-embedded-jse/ws/src/main/java/launcher/JSELauncherBindingWSCalculator.java>:[24,34]
package org.apache.tuscany.sca.node does not exist

[ERROR]
<https://hudson.apache.org/hudson/job/Tuscany-2x/org.apache.tuscany.sca$sample-launcher-embedded-jse/ws/src/main/java/launcher/JSELauncherImplementationScriptCalculator.java>:[44,8]
cannot find symbol symbol : class Node location: class launcher.JSELauncherImplementationScriptCalculator

[ERROR]
<https://hudson.apache.org/hudson/job/Tuscany-2x/org.apache.tuscany.sca$sample-launcher-embedded-jse/ws/src/main/java/launcher/JSELauncherImplementationScriptCalculator.java>:[44,61]
cannot find symbol symbol : class Contribution location: class launcher.JSELauncherImplementationScriptCalculator

[ERROR]
<https://hudson.apache.org/hudson/job/Tuscany-2x/org.apache.tuscany.sca$sample-launcher-embedded-jse/ws/src/main/java/launcher/JSELauncherImplementationScriptCalculator.java>:[44,20]
cannot find symbol symbol : variable NodeFactory location: class launcher.JSELauncherImplementationScriptCalculator

[ERROR]
<https://hudson.apache.org/hudson/job/Tuscany-2x/org.apache.tuscany.sca$sample-launcher-embedded-jse/ws/src/main/java/launcher/JSELauncherImplementationJavaCalculatorAsync.java>:[38,8]
cannot find symbol symbol : class Node location: class launcher.JSELauncherImplementationJavaCalculatorAsync

[ERROR]
<https://hudson.apache.org/hudson/job/Tuscany-2x/org.apache.tuscany.sca$sample-launcher-embedded-jse/ws/src/main/java/launcher/JSELauncherImplementationJavaCalculatorAsync.java>:[38,61]
cannot find symbol symbol : class Contribution location: class launcher.JSELauncherImplementationJavaCalculatorAsync

[ERROR]
<https://hudson.apache.org/hudson/job/Tuscany-2x/org.apache.tuscany.sca$sample-launcher-embedded-jse/ws/src/main/java/launcher/JSELauncherImplementationJavaCalculatorAsync.java>:[38,20]
cannot find symbol symbol : variable NodeFactory location: class launcher.JSELauncherImplementationJavaCalculatorAsync

[ERROR]
<https://hudson.apache.org/hudson/job/Tuscany-2x/org.apache.tuscany.sca$sample-launcher-embedded-jse/ws/src/main/java/launcher/JSELauncherBindingJSONRPCCalculator.java>:[44,8]
cannot find symbol symbol : class Node location: class launcher.JSELauncherBindingJSONRPCCalculator

[ERROR]
<https://hudson.apache.org/hudson/job/Tuscany-2x/org.apache.tuscany.sca$sample-launcher-embedded-jse/ws/src/main/java/launcher/JSELauncherBindingJSONRPCCalculator.java>:[44,61]
cannot find symbol symbol : class Contribution location: class launcher.JSELauncherBindingJSONRPCCalculator

[ERROR]
<https://hudson.apache.org/hudson/job/Tuscany-2x/org.apache.tuscany.sca$sample-launcher-embedded-jse/ws/src/main/java/launcher/JSELauncherBindingJSONRPCCalculator.java>:[44,20]
cannot find symbol symbol : variable NodeFactory location: class launcher.JSELauncherBindingJSONRPCCalculator

[ERROR]
<https://hudson.apache.org/hudson/job/Tuscany-2x/org.apache.tuscany.sca$sample-launcher-embedded-jse/ws/src/main/java/launcher/JSELauncherImplementationJavaCalculator.java>:[40,8]
cannot find symbol symbol : class Node location: class launcher.JSELauncherImplementationJavaCalculator

[ERROR]
<https://hudson.apache.org/hudson/job/Tuscany-2x/org.apache.tuscany.sca$sample-launcher-embedded-jse/ws/src/main/java/launcher/JSELauncherImplementationJavaCalculator.java>:[40,61]
cannot find symbol symbol : class Contribution location: class launcher.JSELauncherImplementationJavaCalculator

[ERROR]
<https://hudson.apache.org/hudson/job/Tuscany-2x/org.apache.tuscany.sca$sample-launcher-embedded-jse/ws/src/main/java/launcher/JSELauncherImplementationJavaCalculator.java>:[40,20]
cannot find symbol symbol : variable NodeFactory location: class launcher.JSELauncherImplementationJavaCalculator

[ERROR]
<https://hudson.apache.org/hudson/job/Tuscany-2x/org.apache.tuscany.sca$sample-launcher-embedded-jse/ws/src/main/java/launcher/JSELauncherBindingRMICalculator.java>:[42,8]
cannot find symbol symbol : class Node location: class launcher.JSELauncherBindingRMICalculator

[ERROR]
<https://hudson.apache.org/hudson/job/Tuscany-2x/org.apache.tuscany.sca$sample-launcher-embedded-jse/ws/src/main/java/launcher/JSELauncherBindingRMICalculator.java>:[42,62]
cannot find symbol symbol : class Contribution location: class launcher.JSELauncherBindingRMICalculator

[ERROR]
<https://hudson.apache.org/hudson/job/Tuscany-2x/org.apache.tuscany.sca$sample-launcher-embedded-jse/ws/src/main/java/launcher/JSELauncherBindingRMICalculator.java>:[42,21]
cannot find symbol symbol : variable NodeFactory location: class launcher.JSELauncherBindingRMICalculator

[ERROR]
<https://hudson.apache.org/hudson/job/Tuscany-2x/org.apache.tuscany.sca$sample-launcher-embedded-jse/ws/src/main/java/launcher/JSELauncherBindingRMICalculator.java>:[43,8]
cannot find symbol symbol : class Node location: class launcher.JSELauncherBindingRMICalculator

[ERROR]
<https://hudson.apache.org/hudson/job/Tuscany-2x/org.apache.tuscany.sca$sample-launcher-embedded-jse/ws/src/main/java/launcher/JSELauncherBindingRMICalculator.java>:[43,62]
cannot find symbol symbol : class Contribution location: class launcher.JSELauncherBindingRMICalculator

[ERROR]
<https://hudson.apache.org/hudson/job/Tuscany-2x/org.apache.tuscany.sca$sample-launcher-embedded-jse/ws/src/main/java/launcher/JSELauncherBindingRMICalculator.java>:[43,21]
cannot find symbol symbol : variable NodeFactory location: class launcher.JSELauncherBindingRMICalculator

[ERROR]
<https://hudson.apache.org/hudson/job/Tuscany-2x/org.apache.tuscany.sca$sample-launcher-embedded-jse/ws/src/main/java/launcher/JSELauncherBindingSCACalculator.java>:[44,8]
cannot find symbol symbol : class Node location: class launcher.JSELauncherBindingSCACalculator

[ERROR]
<https://hudson.apache.org/hudson/job/Tuscany-2x/org.apache.tuscany.sca$sample-launcher-embedded-jse/ws/src/main/java/launcher/JSELauncherBindingSCACalculator.java>:[44,61]
cannot find symbol symbol : class Contribution location: class launcher.JSELauncherBindingSCACalculator

[ERROR]
<https://hudson.apache.org/hudson/job/Tuscany-2x/org.apache.tuscany.sca$sample-launcher-embedded-jse/ws/src/main/java/launcher/JSELauncherBindingSCACalculator.java>:[44,20]
cannot find symbol symbol : variable NodeFactory location: class launcher.JSELauncherBindingSCACalculator

[ERROR]
<https://hudson.apache.org/hudson/job/Tuscany-2x/org.apache.tuscany.sca$sample-launcher-embedded-jse/ws/src/main/java/launcher/JSELauncherBindingWSCalculator.java>:[44,8]
cannot find symbol symbol : class Node location: class launcher.JSELauncherBindingWSCalculator

[ERROR]
<https://hudson.apache.org/hudson/job/Tuscany-2x/org.apache.tuscany.sca$sample-launcher-embedded-jse/ws/src/main/java/launcher/JSELauncherBindingWSCalculator.java>:[44,61]
cannot find symbol symbol : class Contribution location: class launcher.JSELauncherBindingWSCalculator

[ERROR]
<https://hudson.apache.org/hudson/job/Tuscany-2x/org.apache.tuscany.sca$sample-launcher-embedded-jse/ws/src/main/java/launcher/JSELauncherBindingWSCalculator.java>:[44,20]
cannot find symbol symbol : variable NodeFactory location: class launcher.JSELauncherBindingWSCalculator

[INFO] 45 errors [INFO] ------------------------------------------------------------- [HUDSON] Archiving disabled - not archiving
<https://hudson.apache.org/hudson/job/Tuscany-2x/org.apache.tuscany.sca$sample-launcher-embedded-jse/ws/pom.xml>