atom feed1 message in org.apache.tuscany.commitsBuild failed in Hudson: Tuscany-2x » ...
FromSent OnAttachments
Apache Hudson ServerDec 12, 2010 2:25 am 
Subject:Build failed in Hudson: Tuscany-2x » Apache Tuscany Async Integration Tests SCA Binding Mapper #18
From:Apache Hudson Server (hud@hudson.apache.org)
Date:Dec 12, 2010 2:25:07 am
List:org.apache.tuscany.commits

See
<https://hudson.apache.org/hudson/job/Tuscany-2x/org.apache.tuscany.sca$itest-scabindingmapper/18/>

------------------------------------------ [INFO] ------------------------------------------------------------------------ [INFO] Building Apache Tuscany Async Integration Tests SCA Binding Mapper [INFO] task-segment: [clean, install] [INFO] ------------------------------------------------------------------------ [INFO] [clean:clean] [INFO] [enforcer:enforce {execution: enforce-plugin-versions}] [INFO] [remote-resources:process {execution: default}] [INFO] [resources:resources] [INFO] Using 'UTF-8' encoding to copy filtered resources. [INFO] Copying 2 resources [INFO] Copying 0 resource [INFO] Copying 3 resources [INFO] [compiler:compile] [INFO] Compiling 2 source files to
<https://hudson.apache.org/hudson/job/Tuscany-2x/org.apache.tuscany.sca$itest-scabindingmapper/ws/target/classes> [INFO] ------------------------------------------------------------- [ERROR] COMPILATION ERROR : [INFO] ------------------------------------------------------------- [ERROR]
<https://hudson.apache.org/hudson/job/Tuscany-2x/org.apache.tuscany.sca$itest-scabindingmapper/ws/src/main/java/itest/scabindingmapper/MyMapper.java>:[27,50]
package org.apache.tuscany.sca.binding.sca.provider does not exist

[ERROR]
<https://hudson.apache.org/hudson/job/Tuscany-2x/org.apache.tuscany.sca$itest-scabindingmapper/ws/src/main/java/itest/scabindingmapper/MyMapper.java>:[37,30]
cannot find symbol symbol: class DefaultSCABindingMapper public class MyMapper extends DefaultSCABindingMapper {

[ERROR]
<https://hudson.apache.org/hudson/job/Tuscany-2x/org.apache.tuscany.sca$itest-scabindingmapper/ws/src/main/java/itest/scabindingmapper/MyMapper.java>:[48,19]
cannot find symbol symbol : variable super location: class itest.scabindingmapper.MyMapper

[ERROR]
<https://hudson.apache.org/hudson/job/Tuscany-2x/org.apache.tuscany.sca$itest-scabindingmapper/ws/src/main/java/itest/scabindingmapper/MyMapper.java>:[43,4]
method does not override or implement a method from a supertype

[ERROR]
<https://hudson.apache.org/hudson/job/Tuscany-2x/org.apache.tuscany.sca$itest-scabindingmapper/ws/src/main/java/itest/scabindingmapper/MyMapper.java>:[57,19]
cannot find symbol symbol : variable super location: class itest.scabindingmapper.MyMapper

[ERROR]
<https://hudson.apache.org/hudson/job/Tuscany-2x/org.apache.tuscany.sca$itest-scabindingmapper/ws/src/main/java/itest/scabindingmapper/MyMapper.java>:[52,4]
method does not override or implement a method from a supertype

[ERROR]
<https://hudson.apache.org/hudson/job/Tuscany-2x/org.apache.tuscany.sca$itest-scabindingmapper/ws/src/main/java/itest/scabindingmapper/MyMapper.java>:[65,4]
method does not override or implement a method from a supertype

[INFO] 7 errors [INFO] ------------------------------------------------------------- [HUDSON] Archiving disabled - not archiving
<https://hudson.apache.org/hudson/job/Tuscany-2x/org.apache.tuscany.sca$itest-scabindingmapper/ws/pom.xml>