156 messages

org.codehaus.cargo.dev [All Lists]

2012 October [All Months]

Page 1 (Messages 1 to 25): 1 2 3 4 5 6 7

[cargo-dev] [Bamboo] Cargo > CARGO trunks - Compile and test (JDK 1.5, Maven2) > #1396 has FAILED - Codehaus Bamboo
[cargo-dev] [Bamboo] Cargo > CARGO trunks - Compile, test and deploy (JDK 7, Maven3) > #498 has FAILED (8 times). - Codehaus Bamboo
[cargo-dev] [Bamboo] Cargo > CARGO trunks - Compile, test and deploy (JDK 7, Maven3) > #499 has FAILED (9 times). - Codehaus Bamboo
[cargo-dev] [Bamboo] Cargo > CARGO trunks - Compile, test and deploy (JDK 7, Maven3) > #500 has FAILED (10 times). - Codehaus Bamboo
[cargo-dev] [Bamboo] Cargo > CARGO trunks - Compile and test (JDK 6, Maven3) > #703 was SUCCESSFUL (with 779 tests). Change made by dnowicki. - Codehaus Bamboo
[cargo-dev] [Bamboo] Cargo > CARGO trunks - Compile, test and deploy (JDK 7, Maven3) > #503 has FAILED (13 times). - Codehaus Bamboo
[cargo-dev] [Bamboo] Cargo > CARGO trunks - Compile, test and deploy (JDK 7, Maven3) > #507 has FAILED (17 times). - Codehaus Bamboo
[cargo-dev] [cargo] r3447 - in extensions/trunk/daemon: client/src/main/java/org/codehaus/cargo/tools/daemon webapp/src/main/java/org/codehaus/cargo/daemon webapp/src/main/webapp webapp/src/main/webapp/WEB-INF - alit...@codehaus.org
[cargo-dev] [cargo] r3449 - core/trunk/api/container/src/main/java/org/codehaus/cargo/container/internal/util - alit...@codehaus.org
[cargo-dev] [Bamboo] Cargo > Containers - Jetty 7.x > #859 was SUCCESSFUL after 2 failures. - Codehaus Bamboo
[cargo-dev] [cargo] r3458 - extensions/trunk/maven2/samples/uberwar-test/src/test/java/org/codehaus/cargo/sample/maven2/uberwar_test - alit...@codehaus.org
[cargo-dev] [cargo] r3459 - in core/trunk: containers/jboss/src/main/java/org/codehaus/cargo/container/jboss documentation/src/main/java/org/codehaus/cargo/documentation samples/java/src/test/java/org/codehaus/cargo/sample/java - alit...@codehaus.org
[cargo-dev] [cargo] r3466 - in extensions/trunk: . ant ant/samples ant/samples/configurationFiles-test ant/samples/datasource-test ant/samples/remote-test ant/tasks daemon daemon/client daemon/webapp maven2 maven2/archetypes maven2/archetypes/remote-deployment maven2/archetypes/webapp-functional-tests-module maven2/archetypes/webapp-single-module maven2/archetypes/webapp-with-datasource maven2/plugin maven2/samples maven2/samples/artifactInstaller-test maven2/samples/autoDeployable-test maven2/samples/configurationFiles-test maven2/samples/implementationClasses-test maven2/samples/inPlaceDevelopment-test maven2/samples/jetty7x-embedded-test maven2/samples/jetty7x-root-context-test maven2/samples/jetty8x-embedded-test maven2/samples/multi-datasource-test maven2/samples/ping-test maven2/samples/remoteDeploy-test maven2/samples/runMojo-test maven2/samples/tomcat7x-context-test maven2/samples/tomcat7x-systemProperty-test maven2/samples/uberwar-test maven2/samples/websphe re-test - alit...@codehaus.org
[cargo-dev] [cargo] r3474 - extensions/tags/cargo-extensions-1.3.0/maven2/samples/jetty9x-embedded-test - alit...@codehaus.org
Re: [cargo-dev] CARGO 1.3.0: Now ready for testing - S. Ali Tokmen
[cargo-dev] [cargo] r3479 - extensions/trunk/daemon/webapp/src/main/java/org/codehaus/cargo/daemon/request - alit...@codehaus.org
[cargo-dev] [cargo] r3480 - extensions/trunk - alit...@codehaus.org
[cargo-dev] [cargo] r3481 - in extensions/trunk/daemon: . itests itests/browser itests/browser/src/test/java/org/codehaus/cargo itests/browser/src/test/java/org/codehaus/cargo/itests itests/browser/src/test/java/org/codehaus/cargo/itests/daemon itests/browser/src/test/java/org/codehaus/cargo/itests/daemon/browser webapp/src/main/java/org/codehaus/cargo/daemon/request - alit...@codehaus.org
[cargo-dev] [Bamboo] Cargo > CARGO trunks - Compile and test (JDK 6, Maven3) > #729 has FAILED. Change made by alitokmen. - Codehaus Bamboo
[cargo-dev] [Bamboo] Cargo > CARGO trunks - Compile and test (JDK 6, Maven3) > #731 was SUCCESSFUL (with 780 tests). Change made by alitokmen. - Codehaus Bamboo
[cargo-dev] [Bamboo] Cargo > CARGO trunks - Compile and test (JDK 1.5, Maven2) > #1420 has FAILED (2 tests failed, no failures were new) - Codehaus Bamboo
[cargo-dev] [Bamboo] Cargo > CARGO trunks - Compile and test (JDK 6, Maven3) > #733 has FAILED. Change made by alitokmen. - Codehaus Bamboo
[cargo-dev] [cargo] r3486 - extensions/trunk/daemon/webapp/src/main/java/org/codehaus/cargo/daemon - alit...@codehaus.org
[cargo-dev] [Bamboo] Cargo > CARGO trunks - Compile and test (JDK 6, Maven3) > #735 has FAILED (1 tests failed, no failures were new). Change made by alitokmen. - Codehaus Bamboo
[cargo-dev] [Bamboo] Cargo > CARGO trunks - Compile and test (JDK 6, Maven3) > #736 was SUCCESSFUL (with 780 tests). Change made by alitokmen. - Codehaus Bamboo

Page 1 (Messages 1 to 25): 1 2 3 4 5 6 7