243 messages

org.codehaus.cargo.dev [All Lists]

2011 June [All Months]

Page 1 (Messages 1 to 25): 1 2 3 4 5 6 7 8 9 10

[cargo-dev] [cargo] r2913 - extensions/trunk/ant/tasks/src/main/java/org/codehaus/cargo/ant - alit...@codehaus.org
[cargo-dev] [Bamboo] Cargo - CARGO trunks - Compile and test (JDK 1.5, Maven2) build 1014 has FAILED (3 tests failed). Change made by alitokmen - Codehaus Bamboo
Re: [cargo-dev] Cargo ANT and Maven start task and the "wait" attribute - S. Ali Tokmen
Re: [cargo-dev] Cargo ANT and Maven start task and the "wait" attribute - Anders Hammar
[cargo-dev] [cargo] r2917 - core/trunk/containers/jonas/src/main/java/org/codehaus/cargo/container/jonas - alit...@codehaus.org
[cargo-dev] [cargo] r2927 - resources/tags - alit...@codehaus.org
[cargo-dev] [cargo] r2931 - in core/trunk: . api api/container api/generic api/module api/util containers containers/geronimo containers/glassfish containers/jboss containers/jetty containers/jo containers/jonas containers/jrun containers/orion containers/resin containers/tomcat containers/weblogic documentation samples samples/java tools tools/jboss-deployer-5 tools/jboss-deployer-5.1-and-onwards uberjar - alit...@codehaus.org
[cargo-dev] [cargo] r2939 - in extensions/trunk/maven2: archetypes archetypes/webapp-with-datasource archetypes/webapp-with-datasource/src/it/generate-and-build archetypes/webapp-with-datasource/src/main/resources/META-INF/maven archetypes/webapp-with-datasource/src/main/resources/archetype-resources archetypes/webapp-with-datasource/src/main/resources/archetype-resources/src/main/java archetypes/webapp-with-datasource/src/main/resources/archetype-resources/src/main/webapp archetypes/webapp-with-datasource/src/main/resources/archetype-resources/src/main/webapp/WEB-INF archetypes/webapp-with-datasource/src/main/resources/archetype-resources/src/test/java samples - alit...@codehaus.org
[cargo-dev] [Bamboo] Cargo - CARGO trunks - Compile and test (JDK 1.5, Maven2) build 1035 was SUCCESSFUL (with 686 tests). Change made by alitokmen - Codehaus Bamboo
[cargo-dev] [cargo] r2944 - in extensions/trunk/maven2/plugin/src/main/java/org/codehaus/cargo/maven2: . configuration - alit...@codehaus.org
[cargo-dev] [cargo] r2945 - in extensions/trunk/maven2: archetypes archetypes/remote-deployment archetypes/remote-deployment/src/it/generate-and-build archetypes/remote-deployment/src/main/resources/META-INF/maven archetypes/remote-deployment/src/main/resources/archetype-resources archetypes/remote-deployment/src/main/resources/archetype-resources/src/main archetypes/remote-deployment/src/main/resources/archetype-resources/src/main/webapp archetypes/remote-deployment/src/main/resources/archetype-resources/src/main/webapp/WEB-INF archetypes/remote-deployment/src/main/resources/archetype-resources/src/test/java archetypes/remote-deployment/src/main/resources/archetype-resources/src/test/java/it samples - alit...@codehaus.org
[cargo-dev] [cargo] r2954 - in extensions/trunk/maven2/samples: autoDeployable-test/src/test/java/org/codehaus/cargo/sample/maven2/autoDeployable_test jetty7x-embedded-test/src/test/java/org/codehaus/cargo/sample/maven2/jetty7x_embedded tomcat7x-context-test/src/test/java/org/codehaus/cargo/sample/maven2/tomcat7x_context_test - alit...@codehaus.org
[cargo-dev] [cargo] r2957 - in extensions/trunk/maven2/samples: . implementationClasses-test implementationClasses-test/src/test/java/org/codehaus/cargo/sample/maven2 implementationClasses-test/src/test/java/org/codehaus/cargo/sample/maven2/implementationClasses_test todo - alit...@codehaus.org
[cargo-dev] [Bamboo] Cargo - CARGO trunks - Compile and test (JDK 1.5, Maven2) build 1052 has FAILED (0 tests failed) - Codehaus Bamboo
[cargo-dev] [Bamboo] Cargo - CARGO trunks - Compile and test (JDK 1.5, Maven2) build 1053 was SUCCESSFUL (with 691 tests). Change made by alitokmen - Codehaus Bamboo
Re: [cargo-dev] [cargo] r2959 - extensions/trunk/maven2/samples - Anders Hammar
Re: [cargo-dev] [cargo] r2960 - extensions/trunk/maven2/samples - S. Ali Tokmen
[cargo-dev] [Bamboo] Cargo - CARGO trunks - Compile, test and deploy (JDK 6, Maven3) build 258 has FAILED (0 tests failed) - Codehaus Bamboo
[cargo-dev] [cargo] r2965 - core/trunk/api/container/src/main/java/org/codehaus/cargo/container/spi - alit...@codehaus.org
[cargo-dev] [Bamboo] Cargo - CARGO trunks - Compile, test and deploy (JDK 6, Maven3) build 262 has FAILED (0 tests failed) - Codehaus Bamboo
[cargo-dev] [cargo] r2967 - in core/trunk: . api/container api/generic api/module api/util uberjar - alit...@codehaus.org
[cargo-dev] [cargo] r2971 - in extensions/trunk: . ant/tasks maven2/plugin - alit...@codehaus.org
Re: [cargo-dev] [cargo] r2971 - in extensions/trunk: . ant/tasks maven2/plugin - S. Ali Tokmen
Re: [cargo-dev] [cargo] r2971 - in extensions/trunk: . ant/tasks maven2/plugin - Anders Hammar
Re: [cargo-dev] [cargo] r2967 - in core/trunk: . api/container api/generic api/module api/util uberjar - S. Ali Tokmen

Page 1 (Messages 1 to 25): 1 2 3 4 5 6 7 8 9 10