712 messages

org.codehaus.cargo.dev [All Lists]

2011 March [All Months]

Page 1 (Messages 1 to 25): 1 2 3 4 5 6 7 8 9 10 11 12 13 14 15 16 17 18 19 20 21 22 23 24 25 26 27 28 29

[cargo-dev] [cargo] r2706 - in extensions/trunk: ant/samples/datasource-test/src/test/resources ant/tasks/src/main/java/org/codehaus/cargo/ant maven2/archetypes/webapp-functional-tests-module/src/main/resources/archetype-resources/__rootArtifactId__-functional-tests maven2/archetypes/webapp-single-module/src/main/resources/archetype-resources maven2/plugin/src/main/java/org/codehaus/cargo/maven2 maven2/samples/datasource-test maven2/samples/jetty7x-embedded-test maven2/samples/todo/testStartWithOneWarOneEarDeployed maven2/samples/todo/testStopEmbeddedContainerInAnotherExecution maven2/samples/tomcat7x-context-test - alit...@codehaus.org
[cargo-dev] [Bamboo] Cargo - CARGO trunks (JDK 1.5) build 848 has FAILED (0 tests failed). Change made by alitokmen - Codehaus Bamboo
[cargo-dev] [cargo] r2713 - in core/trunk: api/container/src/main/java/org/codehaus/cargo/container/spi api/module/src/main/java/org/codehaus/cargo/module/webapp/merge api/util/src/main/java/org/codehaus/cargo/util containers/jo/src/main/java/org/codehaus/cargo/container/jo - bent...@codehaus.org
[cargo-dev] [cargo] r2714 - core/trunk/samples - alit...@codehaus.org
[cargo-dev] [Bamboo] Cargo - CARGO trunks (JDK 1.5) build 854 has FAILED (0 tests failed). Change made by alitokmen - Codehaus Bamboo
[cargo-dev] [Bamboo] Cargo - CARGO trunks (JDK 1.5) build 856 has FAILED (0 tests failed) - Codehaus Bamboo
Re: [cargo-dev] Exit status of Glassfish's asadmin - S. Ali Tokmen
Re: [cargo-dev] [Bamboo] Cargo - CARGO trunks (JDK 1.5) - Deploy build 107 has FAILED. Change made by alitokmen - Benjamin Bentmann
[cargo-dev] [Bamboo] Cargo - CARGO trunks (JDK 1.5) - Deploy build 109 was SUCCESSFUL (with 663 tests). Change made by bentmann - Codehaus Bamboo
Re: [cargo-dev] Test instability - Anders Hammar
[cargo-dev] [cargo] r2734 - core/trunk/api/container/src/main/java/org/codehaus/cargo/container/spi - alit...@codehaus.org
[cargo-dev] [cargo] r2737 - core/trunk/api/container/src/main/java/org/codehaus/cargo/container/spi - alit...@codehaus.org
[cargo-dev] [cargo] r2757 - pom/trunk - afl...@codehaus.org
Re: [cargo-dev] [cargo] r2771 - core/trunk/api/container/src/main/java/org/codehaus/cargo/container/spi - Benjamin Bentmann
[cargo-dev] [cargo] r2777 - core/trunk/containers/jetty/src/main/java/org/codehaus/cargo/container/jetty/internal - bent...@codehaus.org
[cargo-dev] [cargo] r2780 - core/trunk/containers/tomcat/src/main/java/org/codehaus/cargo/container/tomcat/internal core/trunk/containers/tomcat/src/main/resources/org/codehaus/cargo/container/internal/resources/tomcat5x core/trunk/containers/tomcat/src/main/resources/org/codehaus/cargo/container/internal/resources/tomcat6x core/trunk/containers/tomcat/src/main/resources/org/codehaus/cargo/container/internal/resources/tomcat7x extensions/trunk/maven2/plugin/src/main/java/org/codehaus/cargo/maven2 extensions/trunk/maven2/plugin/src/main/java/org/codehaus/cargo/maven2/configuration - alit...@codehaus.org
[cargo-dev] [cargo] r2792 - in core/trunk/containers/jetty/src/main: java/org/codehaus/cargo/container/jetty/internal resources/org/codehaus/cargo/container/internal/resources/jetty6x resources/org/codehaus/cargo/container/internal/resources/jetty7x - bent...@codehaus.org
[cargo-dev] [cargo] r2793 - core/trunk/api/container/src/main/java/org/codehaus/cargo/container/internal/util - alit...@codehaus.org
Re: [cargo-dev] Checkstyle: Boolean expression complexity is 4 (max allowed is 3) - Anders Hammar
[cargo-dev] [cargo] r2811 - extensions/trunk/maven2/samples/tomcat7x-context-test - alit...@codehaus.org
[cargo-dev] [cargo] r2813 - core/trunk/api/util/src/main/java/org/codehaus/cargo/util - alit...@codehaus.org
[cargo-dev] [cargo] r2817 - core/trunk/api/util/src/test/java/org/codehaus/cargo/util - alit...@codehaus.org
Re: [cargo-dev] AbstractCopyingInstalledLocalDeployer.deploy(...) - Benjamin Bentmann
Re: [cargo-dev] Integration tests - Anders Hammar
[cargo-dev] [cargo] r2826 - core/trunk/samples - afl...@codehaus.org

Page 1 (Messages 1 to 25): 1 2 3 4 5 6 7 8 9 10 11 12 13 14 15 16 17 18 19 20 21 22 23 24 25 26 27 28 29