19 messages

org.codehaus.berkano.scm [All Lists]

2006 February [All Months]

[continuum] BUILD ERROR: Berkano Parent POM - Cont...@cheddar.simulalabs.com
[continuum] BUILD ERROR: Berkano Parent POM - Cont...@cheddar.simulalabs.com
[continuum] BUILD ERROR: Berkano Parent POM - Cont...@cheddar.simulalabs.com
[continuum] BUILD ERROR: Berkano Parent POM - Cont...@cheddar.simulalabs.com
[continuum] BUILD FAILURE: Berkano Parent POM - Cont...@cheddar.simulalabs.com
[continuum] BUILD FAILURE: Berkano Parent POM - Cont...@cheddar.simulalabs.com
[290] berkano/trunk/puzzles/puzzles-core/src/main/java/net/dasouk/puzzles/package.html: test commit :o - sc...@berkano.codehaus.org
[291] berkano/trunk/puzzles/puzzles-core: Big commit, lots of modifications: - sc...@berkano.codehaus.org
[continuum] BUILD FAILURE: Berkano Parent POM - Cont...@cheddar.simulalabs.com
[292] berkano/trunk/puzzles/puzzles-core/src/main/java/net/dasouk/puzzles/stores/SimpleFileSystemStore.java: removed unnecessary "spring" setters - sc...@berkano.codehaus.org
[293] berkano/trunk/puzzles/puzzles-core/src/main/java/net/dasouk/puzzles/registries/SimplePluginRegistry.java: minor improvements on the pluginStateManager interaction - sc...@berkano.codehaus.org
[294] berkano/trunk/puzzles/puzzles-core/src/test/java/net/dasouk/puzzles/registries/SimplePluginRegistryTest.java: added two more tests (mainly in case of non existing plugins) - sc...@berkano.codehaus.org
[continuum] BUILD FAILURE: Berkano Parent POM - Cont...@cheddar.simulalabs.com
[continuum] BUILD FAILURE: Berkano Parent POM - Cont...@cheddar.simulalabs.com
[continuum] BUILD FAILURE: Berkano Parent POM - Cont...@cheddar.simulalabs.com
[295] berkano/trunk/pom.xml: release 20060221 - sc...@berkano.codehaus.org
[296] berkano/tags/20060221/: tagging 20060221 - sc...@berkano.codehaus.org
[297] berkano/trunk/pom.xml: back to snapshot - sc...@berkano.codehaus.org
[298] berkano/trunk: releasing 20060221b, pfff - sc...@berkano.codehaus.org