238 messages

org.codehaus.berkano.scm [All Lists]

2005 December [All Months]

Page 1 (Messages 1 to 25): 1 2 3 4 5 6 7 8 9 10

[continuum] BUILD ERROR: Berkano Simple Task Manager - Cont...@cheddar.simulalabs.com
[continuum] BUILD ERROR: Berkano Parent POM - Cont...@cheddar.simulalabs.com
[continuum] BUILD ERROR: Puzzles - Cont...@cheddar.simulalabs.com
[continuum] BUILD ERROR: Berkano Simple Task Manager - Cont...@cheddar.simulalabs.com
[continuum] BUILD ERROR: Berkano Parent POM - Cont...@cheddar.simulalabs.com
[206] berkano/trunk/berkano-tools/taskman/src/main/java/net/incongru/taskman/hibernate/HibernatedTaskMan.java: cleanup - sc...@berkano.codehaus.org
[continuum] BUILD ERROR: Berkano Parent POM - Cont...@cheddar.simulalabs.com
[continuum] BUILD ERROR: Berkano Bookmarks - Cont...@cheddar.simulalabs.com
[continuum] BUILD ERROR: Berkano User - Cont...@cheddar.simulalabs.com
[continuum] BUILD ERROR: Joda-Time / Hibernate UserType implementations - Cont...@cheddar.simulalabs.com
[continuum] BUILD ERROR: Berkano User Management for Webwork2 - Cont...@cheddar.simulalabs.com
[continuum] BUILD ERROR: Puzzles - Cont...@cheddar.simulalabs.com
[207] berkano/trunk/berkano-tools/taskman/src/main/java/net/incongru/taskman: * TaskInstance now returns an unmodifiable Map of variables - sc...@berkano.codehaus.org
[212] berkano/trunk/berkano-tools/taskman/src/main/java/net/incongru/taskman/TaskMan.java: todo - sc...@berkano.codehaus.org
[continuum] BUILD ERROR: Berkano Seraph Tools - Cont...@assiette.local
[continuum] BUILD ERROR: Berkano Joda-Time/Hibernate - Cont...@assiette.local
[continuum] BUILD ERROR: BeanDisplayTag - Cont...@assiette.local
[continuum] BUILD FAILURE: Berkano Parent POM - Cont...@cheddar.simulalabs.com
[222] berkano/trunk/berkano-tools/berkano-util/pom.xml: reducing javax.mail dependency to 1.3.2 ? - sc...@berkano.codehaus.org
[223] berkano/trunk/berkano-tools/berkano-util/pom.xml: will this build on CI ? - sc...@berkano.codehaus.org
[224] berkano/trunk/pom.xml: trying to fork tests? - sc...@berkano.codehaus.org
[continuum] BUILD FAILURE: Berkano Parent POM - Cont...@cheddar.simulalabs.com
[234] berkano/trunk/berkano-tools/taskman/src/main/java/net/incongru/taskman/action: fixed test and added a couple of TODOs - sc...@berkano.codehaus.org
[continuum] BUILD FAILURE: Berkano Parent POM - Cont...@cheddar.simulalabs.com
[236] berkano/trunk/pom.xml: added <pluginRepository> - sc...@berkano.codehaus.org

Page 1 (Messages 1 to 25): 1 2 3 4 5 6 7 8 9 10