21 messages

org.apache.incubator.ctakes-notifications [All Lists]

2017 February [All Months]

[jira] [Commented] (CTAKES-412) Unable to Load AggregatePlaintextUMLSProcessor.XML - Steven Kahn (JIRA)
[jira] [Comment Edited] (CTAKES-412) Unable to Load AggregatePlaintextUMLSProcessor.XML - Steven Kahn (JIRA)
Build failed in Jenkins: ctakes-trunk-compiletest » Apache cTAKES Temporal Information Extraction #931 - Apache Jenkins Server
Build failed in Jenkins: ctakes-trunk-compiletest #931 - Apache Jenkins Server
Build failed in Jenkins: ctakes-trunk-compiletest » Apache cTAKES Temporal Information Extraction #932 - Apache Jenkins Server
Build failed in Jenkins: ctakes-trunk-compiletest #932 - Apache Jenkins Server
Jenkins build is back to normal : ctakes-trunk-compiletest » Apache cTAKES Temporal Information Extraction #933 - Apache Jenkins Server
Jenkins build is back to normal : ctakes-trunk-compiletest #933 - Apache Jenkins Server
Jenkins build became unstable: ctakes-trunk-compiletest » Apache cTAKES Temporal Information Extraction #934 - Apache Jenkins Server
Jenkins build became unstable: ctakes-trunk-compiletest #934 - Apache Jenkins Server
[jira] [Created] (CTAKES-418) Exception: java.io.FileNotFoundException: ctakes-temporal/data/misc/{various} - James Joseph Masanz (JIRA)
[jira] [Commented] (CTAKES-418) Exception: java.io.FileNotFoundException: ctakes-temporal/data/misc/{various} - James Joseph Masanz (JIRA)
[jira] [Commented] (CTAKES-418) Exception: java.io.FileNotFoundException: ctakes-temporal/data/misc/{various} - ASF subversion and git services (JIRA)
Jenkins build is still unstable: ctakes-trunk-compiletest » Apache cTAKES Temporal Information Extraction #935 - Apache Jenkins Server
Jenkins build is still unstable: ctakes-trunk-compiletest #935 - Apache Jenkins Server
[jira] [Resolved] (CTAKES-418) Exception: java.io.FileNotFoundException: ctakes-temporal/data/misc/{various} - James Joseph Masanz (JIRA)
[jira] [Created] (CTAKES-419) ctakes-trunk-compiletest fails Caused by: org.apache.uima.cas.CASRuntimeException: No sofaFS with name UriView found. - James Joseph Masanz (JIRA)
[jira] [Commented] (CTAKES-419) ctakes-trunk-compiletest fails Caused by: org.apache.uima.cas.CASRuntimeException: No sofaFS with name UriView found. - ASF subversion and git services (JIRA)
Jenkins build is back to stable : ctakes-trunk-compiletest » Apache cTAKES Temporal Information Extraction #936 - Apache Jenkins Server
Jenkins build is back to stable : ctakes-trunk-compiletest #936 - Apache Jenkins Server
[jira] [Resolved] (CTAKES-419) ctakes-trunk-compiletest fails Caused by: org.apache.uima.cas.CASRuntimeException: No sofaFS with name UriView found. - James Joseph Masanz (JIRA)