58 messages

org.apache.harmony.alerts [All Lists]

2009 July [All Months]

Page 2 (Messages 26 to 50): 1 2 3

[build-test alert] FAILED Linux x86_64: drlvm-test debug - nom...@intel.com
[build-test alert] PASSED Windows 2003 x86_64: drlvm-test debug - nom...@intel.com
[build-test alert] FAILED Linux x86_64: drlvm-test debug - nom...@intel.com
[build-test alert] PASSED Linux x86_64: drlvm-test debug - nom...@intel.com
Build failed in Hudson: Harmony-1.6-head-linux-x86_64 #58 - Apache Hudson Server
[build-test alert] FAILED Linux x86_64: drlvm-test debug - nom...@intel.com
[build-test alert] PASSED Linux x86_64: drlvm-reg-test debug - nom...@intel.com
Build failed in Hudson: Harmony-1.5-head-linux-x86_64 #318 - Apache Hudson Server
Build failed in Hudson: Harmony-1.5-head-linux-x86_64 #319 - Apache Hudson Server
Build failed in Hudson: Harmony-1.5-head-linux-x86_64 #320 - Apache Hudson Server
Build failed in Hudson: Harmony-1.5-head-linux-x86_64 #324 - Apache Hudson Server
Build failed in Hudson: Harmony-1.5-head-linux-x86_64 #326 - Apache Hudson Server
Build failed in Hudson: Harmony-1.5-head-linux-x86_64 #327 - Apache Hudson Server
Build failed in Hudson: Harmony-1.5-head-linux-x86_64 #328 - Apache Hudson Server
Build failed in Hudson: Harmony-1.5-head-linux-x86_64 #331 - Apache Hudson Server
Build failed in Hudson: Harmony-1.5-head-linux-x86_64 #332 - Apache Hudson Server
Build failed in Hudson: Harmony-1.5-head-linux-x86_64 #338 - Apache Hudson Server
Build failed in Hudson: Harmony-1.6-head-linux-x86_64 #60 - Apache Hudson Server
Build failed in Hudson: Harmony-1.6-head-linux-x86_64 #61 - Apache Hudson Server
Hudson build is back to normal: Harmony-1.6-head-linux-x86_64 #64 - Apache Hudson Server
[build-test alert] FAILED Windows 2003 x86_64: jdktools-test debug - nom...@intel.com
[build-test alert] PASSED Windows 2003 x86_64: jdktools-test debug - nom...@intel.com
[build-test alert] FAILED Linux x86_64: jdktools-test debug - nom...@intel.com
[build-test alert] FAILED Windows 2003 x86_64: jdktools-test debug - nom...@intel.com
[build-test alert] PASSED Windows 2003 x86_64: jdktools-test debug - nom...@intel.com

Page 2 (Messages 26 to 50): 1 2 3