58 messages

org.apache.harmony.alerts [All Lists]

2009 July [All Months]

Page 1 (Messages 1 to 25): 1 2 3

[build-test alert] PASSED Linux x86_64: drlvm-test debug - nom...@intel.com
[build-test alert] FAILED Linux x86_64: drlvm-test debug - nom...@intel.com
[build-test alert] PASSED Linux x86_64: drlvm-test debug - nom...@intel.com
[build-test alert] FAILED Linux x86_64: drlvm-test debug - nom...@intel.com
[build-test alert] PASSED Linux x86_64: drlvm-test debug - nom...@intel.com
Hudson build is back to normal: Harmony-1.6-head-linux-x86_64 #59 - Apache Hudson Server
[build-test alert] PASSED Linux x86_64: drlvm-test debug - nom...@intel.com
[build-test alert] FAILED Linux x86_64: drlvm-reg-test debug - nom...@intel.com
[build-test alert] FAILED Linux x86_64: drlvm-test debug - nom...@intel.com
[build-test alert] PASSED Linux x86_64: drlvm-test debug - nom...@intel.com
Build failed in Hudson: Harmony-1.5-head-linux-x86_64 #322 - Apache Hudson Server
Build failed in Hudson: Harmony-1.5-head-linux-x86_64 #323 - Apache Hudson Server
Build failed in Hudson: Harmony-1.5-head-linux-x86_64 #325 - Apache Hudson Server
Build failed in Hudson: Harmony-1.5-head-linux-x86_64 #330 - Apache Hudson Server
Build failed in Hudson: Harmony-1.5-head-linux-x86_64 #333 - Apache Hudson Server
Build failed in Hudson: Harmony-1.5-head-linux-x86_64 #334 - Apache Hudson Server
Build failed in Hudson: Harmony-1.5-head-linux-x86_64 #336 - Apache Hudson Server
Build failed in Hudson: Harmony-1.5-head-linux-x86_64 #337 - Apache Hudson Server
Build failed in Hudson: Harmony-1.6-head-linux-x86_64 #62 - Apache Hudson Server
Build failed in Hudson: Harmony-1.6-head-linux-x86_64 #63 - Apache Hudson Server
Hudson build is back to normal: Harmony-1.5-head-linux-x86_64 #340 - Apache Hudson Server
[build-test alert] PASSED Linux x86_64: drlvm-test debug - nom...@intel.com
[build-test alert] PASSED Linux x86_64: drlvm-test debug - nom...@intel.com
[build-test alert] PASSED Linux x86_64: jdktools-test debug - nom...@intel.com
[build-test alert] PASSED Linux x86_64: drlvm-test debug - nom...@intel.com

Page 1 (Messages 1 to 25): 1 2 3