45 messages

org.apache.harmony.alerts [All Lists]

2009 February [All Months]

Page 1 (Messages 1 to 25): 1 2

[build-test alert] FAILED Windows 2003 x86_64: hdk debug - nom...@intel.com
Build failed in Hudson: Harmony-1.5-head-linux-x86_64 #16 - Apache Hudson Server
Hudson build is back to normal: Harmony-1.5-head-linux-x86_64 #17 - Apache Hudson Server
[build-test alert] PASSED Windows 2003 x86_64: hdk debug - nom...@intel.com
[build-test alert] FAILED Linux x86: hdk debug - nom...@intel.com
[build-test alert] FAILED Windows 2003 x86_64: jdktools-test debug - nom...@intel.com
[build-test alert] FAILED Linux x86: drlvm-test debug - nom...@intel.com
[build-test alert] PASSED Linux x86: drlvm-test debug - nom...@intel.com
[build-test alert] PASSED Linux x86_64: drlvm-reg-test debug - nom...@intel.com
Build failed in Hudson: Harmony-1.5-head-linux-x86_64 #23 - Apache Hudson Server
[build-test alert] PASSED Linux x86_64: drlvm-test debug - nom...@intel.com
Hudson build is back to normal: Harmony-1.5-head-linux-x86_64 #24 - Apache Hudson Server
[build-test alert] PASSED Linux x86: hdk debug - nom...@intel.com
[build-test alert] PASSED Linux x86: drlvm-reg-test debug - nom...@intel.com
[build-test alert] PASSED Linux x86: make-snapshot debug - nom...@intel.com
[build-test alert] PASSED Linux x86: drlvm-test debug - nom...@intel.com
[build-test alert] FAILED Linux x86: drlvm-test debug - nom...@intel.com
Build failed in Hudson: Harmony-1.6-head-linux-x86_64 #10 - Apache Hudson Server
[build-test alert] PASSED Linux x86: drlvm-test debug - nom...@intel.com
[build-test alert] FAILED Linux x86_64: drlvm-test debug - nom...@intel.com
[build-test alert] PASSED Linux x86_64: drlvm-test debug - nom...@intel.com
[build-test alert] FAILED Linux x86: hdk debug - nom...@intel.com
[build-test alert] FAILED Linux x86: drlvm-test debug - nom...@intel.com
[build-test alert] PASSED Linux x86: hdk debug - nom...@intel.com
Build failed in Hudson: Harmony-1.6-head-linux-x86_64 #12 - Apache Hudson Server

Page 1 (Messages 1 to 25): 1 2