672 messages

org.apache.harmony.alerts [All Lists]

2007 May [All Months]

Page 26 (Messages 626 to 650): 1 2 3 4 5 6 7 8 9 10 11 12 13 14 15 16 17 18 19 20 21 22 23 24 25 26 27

[continuum] BUILD FAILURE: Classlib/linux.ia32 Build/Test - nom...@hursley.ibm.com
[build-test alert] BUILD SUCCEEDED Linux SUSE 9 64bit gcc debug: drlvm tests - nom...@intel.com
[build-test alert] BUILD FAILED Linux SUSE 9 64bit gcc debug: classlib over drlvm - nom...@intel.com
[build-test alert] BUILD SUCCEEDED Linux SUSE9 64bit gcc debug: classlib - nom...@intel.com
[build-test alert] BUILD FAILED Windows 2003 x86_64 msvc debug: drlvm - nom...@intel.com
[build-test alert] BUILD FAILED SUSEL9 IA32 gcc debug: classlib tests iterative - nom...@intel.com
[continuum] BUILD SUCCESSFUL: Classlib/linux.ia32 Build/Test - nom...@hursley.ibm.com
[build-test alert] BUILD SUCCEEDED Linux SUSE 9 64bit gcc debug: drlvm reg.test - nom...@intel.com
[build-test alert] BUILD SUCCEEDED Windows 2003 x86_64 msvc debug: drlvm - nom...@intel.com
[build-test alert] BUILD FAILED SUSEL9 IA32 gcc debug: classlib tests iterative - nom...@intel.com
[build-test alert] BUILD FAILED SUSEL9 IA32 gcc debug: classlib tests iterative - nom...@intel.com
[continuum] BUILD SUCCESSFUL: Classlib/linux.ia32 Build/Test - nom...@hursley.ibm.com
[build-test alert] BUILD FAILED Windows 2003 x86_64 msvc debug: drlvm - nom...@intel.com
[build-test alert] BUILD SUCCEEDED Windows 2003 x86_64 msvc debug: classlib tests - nom...@intel.com
[build-test alert] BUILD FAILED Linux SUSE 9 64bit gcc debug: classlib over drlvm - nom...@intel.com
[build-test alert] BUILD SUCCEEDED Linux SUSE 9 64bit gcc debug: classlib over drlvm - nom...@intel.com
[build-test alert] BUILD FAILED Windows XP x86: classlib-test - nbe...@kc.rr.com
[build-test alert] BUILD FAILED lnx gcc debug: drlvm - nom...@frigga.cs.uiuc.edu
[build-test alert] BUILD SUCCEEDED Linux SUSE 9 x86: jdktools_test - nom...@intel.com
[build-test alert] BUILD FAILED LINUX SUSE 9 x86: harmony_hdk - nom...@intel.com
[build-test alert] BUILD SUCCEEDED Windows XP ia32 msvc debug: drlvm - nom...@intel.com
[build-test alert] BUILD FAILED Windows 2000 x86: classlib-test - nbe...@kc.rr.com
[build-test alert] BUILD FAILED Windows 2000 x86: classlib-test - nbe...@kc.rr.com
[build-test alert] BUILD FAILED Windows 2000 x86: drlvm-test - nbe...@kc.rr.com
[build-test alert] BUILD FAILED Linux SUSE 9 64bit gcc debug: drlvm tests - nom...@intel.com

Page 26 (Messages 626 to 650): 1 2 3 4 5 6 7 8 9 10 11 12 13 14 15 16 17 18 19 20 21 22 23 24 25 26 27