672 messages

org.apache.harmony.alerts [All Lists]

2007 May [All Months]

Page 23 (Messages 551 to 575): 1 2 3 4 5 6 7 8 9 10 11 12 13 14 15 16 17 18 19 20 21 22 23 24 25 26 27

[build-test alert] BUILD FAILED Windows 2003 x86_64 msvc debug: classlib tests - nom...@intel.com
[build-test alert] BUILD FAILED LINUX SUSE 9 x86: jdktools_test - nom...@intel.com
[build-test alert] BUILD SUCCEEDED Windows 2003 x86_64 msvc debug: drlvm - nom...@intel.com
[continuum] BUILD FAILURE: Classlib/linux.ia32 Build/Test - nom...@hursley.ibm.com
[build-test alert] BUILD FAILED SUSEL9 IA32 gcc debug: classlib tests iterative - nom...@intel.com
[build-test alert] BUILD FAILED SUSEL9 IA32 gcc debug: classlib tests iterative - nom...@intel.com
[build-test alert] BUILD FAILED Linux SUSE 9 64bit gcc debug: drlvm tests - nom...@intel.com
[build-test alert] BUILD FAILED Windows XP SP2 msvc debug: drlvm tests - nom...@intel.com
[build-test alert] BUILD FAILED SUSEL9 IA32 gcc debug: classlib tests iterative - nom...@intel.com
[build-test alert] BUILD FAILED SUSEL9 IA32 gcc debug: classlib tests iterative - nom...@intel.com
[build-test alert] BUILD SUCCEEDED Linux SUSE 9 x86: tomcat start - nom...@intel.com
[build-test alert] BUILD FAILED SUSEL9 IA32 gcc debug: classlib tests iterative - nom...@intel.com
[build-test alert] BUILD FAILED Windows 2003 x86_64 msvc debug: classlib tests - nom...@intel.com
[build-test alert] BUILD SUCCEEDED Linux SUSE 9 64bit gcc debug: drlvm tests - nom...@intel.com
[build-test alert] BUILD FAILED Linux SUSE 9 64bit gcc debug: drlvm tests - nom...@intel.com
[build-test alert] BUILD SUCCEEDED Linux SUSE 9 64bit gcc debug: drlvm tests - nom...@intel.com
[build-test alert] BUILD FAILED Linux SUSE 9 64bit gcc debug: drlvm tests - nom...@intel.com
[build-test alert] BUILD SUCCEEDED Linux SUSE 9 gcc debug: drlvm test - nom...@intel.com
[build-test alert] BUILD FAILED Windows XP ia32 msvc debug: drlvm - nom...@intel.com
[build-test alert] BUILD FAILED Windows XP SP2 x86: harmony_hdk - nom...@intel.com
[build-test alert] BUILD FAILED Windows XP x86: drlvm-test - nbe...@kc.rr.com
[continuum] BUILD SUCCESSFUL: Classlib/linux.ia32 Build/Test - nom...@hursley.ibm.com
[continuum] BUILD SUCCESSFUL: Classlib/linux.ia32 Build/Test - nom...@hursley.ibm.com
[continuum] BUILD FAILURE: Classlib/linux.ia32 Build/Test - nom...@hursley.ibm.com
[continuum] BUILD FAILURE: Classlib/linux.ia32 Build/Test - nom...@hursley.ibm.com

Page 23 (Messages 551 to 575): 1 2 3 4 5 6 7 8 9 10 11 12 13 14 15 16 17 18 19 20 21 22 23 24 25 26 27