672 messages

org.apache.harmony.alerts [All Lists]

2007 May [All Months]

Page 1 (Messages 1 to 25): 1 2 3 4 5 6 7 8 9 10 11 12 13 14 15 16 17 18 19 20 21 22 23 24 25 26 27

[build-test alert] BUILD FAILED Windows 2000 x86: drlvm-test - nbe...@kc.rr.com
[build-test alert] BUILD SUCCEEDED Linux SUSE 9 gcc debug: drlvm test - nom...@intel.com
[build-test alert] BUILD FAILED Windows XP x86: drlvm-test - nbe...@kc.rr.com
[build-test alert] BUILD SUCCEEDED Windows XP SP2 msvc debug: classlib over drlvm - nom...@intel.com
[build-test alert] BUILD FAILED Linux SUSE 9 gcc debug: drlvm test - nom...@intel.com
[build-test alert] BUILD FAILED Windows XP x86: classlib-test - nbe...@kc.rr.com
[build-test alert] BUILD SUCCEEDED Linux SUSE 9 x86_64: harmony_hdk - nom...@intel.com
[build-test alert] BUILD FAILED LINUX SUSE 9 x86_64: jdktools_test - nom...@intel.com
[build-test alert] BUILD SUCCEEDED Linux SUSE 9 x86_64: jdktools_test - nom...@intel.com
[build-test alert] BUILD FAILED Windows XP x86: drlvm-test - nbe...@kc.rr.com
[build-test alert] BUILD PASSED Windows 2000 x86: classlib-test - nbe...@kc.rr.com
[build-test alert] BUILD FAILED Windows XP x86: drlvm-test - nbe...@kc.rr.com
[build-test alert] BUILD SUCCEEDED Linux SUSE 9 64bit gcc debug: drlvm tests - nom...@intel.com
[build-test alert] BUILD FAILED Windows XP x86: classlib-test - nbe...@kc.rr.com
[build-test alert] BUILD FAILED Windows XP SP2 msvc debug: drlvm tests - nom...@intel.com
[build-test alert] BUILD FAILED Windows XP x86: classlib-test - nbe...@kc.rr.com
[build-test alert] BUILD FAILED Windows 2000 x86: drlvm-test - nbe...@kc.rr.com
[build-test alert] BUILD FAILED Windows 2000 x86: drlvm-test - nbe...@kc.rr.com
[build-test alert] BUILD PASSED Windows 2000 x86: classlib-test - nbe...@kc.rr.com
[build-test alert] BUILD FAILED Windows XP x86: drlvm-test - nbe...@kc.rr.com
[build-test alert] BUILD PASSED Windows 2000 x86: classlib-test - nbe...@kc.rr.com
[build-test alert] BUILD FAILED Windows 2000 x86: drlvm-test - nbe...@kc.rr.com
[build-test alert] BUILD FAILED Windows XP x86: classlib-test - nbe...@kc.rr.com
[build-test alert] BUILD FAILED Windows 2000 x86: drlvm-test - nbe...@kc.rr.com
[build-test alert] BUILD PASSED Windows 2000 x86: classlib-test - nbe...@kc.rr.com

Page 1 (Messages 1 to 25): 1 2 3 4 5 6 7 8 9 10 11 12 13 14 15 16 17 18 19 20 21 22 23 24 25 26 27