92 messages

org.apache.harmony.alerts [All Lists]

2006 December [All Months]

Page 1 (Messages 1 to 25): 1 2 3 4

[build-test alert] BUILD FAILED Linux SUSE 9 64bit gcc debug: classlib over drlvm - nom...@intel.com
RE: [build-test alert] BUILD FAILED Windows XP SP2 msvc debug: drlvm tests - Ivanov, Vladimir A
[build-test alert] BUILD FAILED Linux SUSE 9 64bit gcc debug: drlvm tests - nom...@intel.com
[build-test alert] BUILD SUCCEEDED Linux SUSE 9 64bit gcc debug: classlib - nom...@intel.com
[build-test alert] BUILD SUCCEEDED Linux SUSE 9 64bit gcc debug: drlvm - nom...@intel.com
[build-test alert] BUILD FAILED Windows XP SP2 msvc debug: classlib over drlvm - nom...@intel.com
[build-test alert] BUILD SUCCEEDED Windows XP SP2 msvc debug: drlvm - nom...@intel.com
[build-test alert] BUILD FAILED win XP IA32 msvc debug: classlib tests iterative - nom...@intel.com
[continuum] BUILD SUCCESSFUL: Classlib/linux.ia32 Build/Test - nom...@hursley.ibm.com
[build-test alert] BUILD SUCCEEDED Linux SUSE 9 64bit gcc debug: classlib over drlvm - nom...@intel.com
[build-test alert] BUILD SUCCEEDED Linux SUSE 9 64bit gcc debug: classlib over drlvm - nom...@intel.com
[build-test alert] BUILD FAILED win XP IA32 msvc debug: classlib tests iterative - nom...@intel.com
RE: [build-test alert] BUILD HANGED Linux SUSE 9 gcc debug: drlvm - Doubtsova, Tatyana V
[build-test alert] BUILD SUCCEEDED Linux SUSE 9 gcc debug: drlvm - nom...@intel.com
[build-test alert] BUILD SUCCEEDED Linux SUSE 9 gcc debug: classlib over drlvm - nom...@intel.com
[build-test alert] BUILD FIXED SUSEL9 IA32 gcc debug: classlib tests iterative - nom...@intel.com
[build-test alert] BUILD FAILED win XP IA32 msvc debug: classlib tests iterative - nom...@intel.com
[build-test alert] BUILD FAILED win XP IA32 msvc debug: classlib tests iterative - nom...@intel.com
[build-test alert] BUILD FAILED Linux SUSE 9 64bit gcc debug: classlib over drlvm - nom...@intel.com
[build-test alert] BUILD FAILED SUSEL9 IA32 gcc debug: classlib tests iterative - nom...@intel.com
[build-test alert] BUILD FAILED Linux SUSE 9 64bit gcc debug: classlib over drlvm - nom...@intel.com
RE: [build-test alert] BUILD FAILED Linux SUSE 9 64bit gcc debug: classlib over drlvm - Doubtsova, Tatyana V
[build-test alert] BUILD SUCCEEDED Linux SUSE 9 64bit gcc debug: classlib over drlvm - nom...@intel.com
[build-test alert] BUILD FAILED win XP IA32 msvc debug: classlib tests iterative - nom...@intel.com
[build-test alert] BUILD FAILED win XP IA32 msvc debug: classlib tests iterative - nom...@intel.com

Page 1 (Messages 1 to 25): 1 2 3 4