14 messages

org.apache.continuum.notifications [All Lists]

2012 August [All Months]

[continuum] BUILD SUCCESSFUL: Continuum (trunk) - Continuum :: Project - Default Maven 2 Build Definition - Cont...@vmbuild
[continuum] BUILD FAILURE: Continuum (trunk) - Continuum :: Project - Default Maven 2 Build Definition - Cont...@vmbuild
[continuum] BUILD SUCCESSFUL: Continuum (trunk) - Continuum :: Project - Default Maven 2 Build Definition - Cont...@vmbuild
[continuum] BUILD FAILURE: Continuum (trunk) - Continuum :: Webapp Tests - Default Maven 2 Build Definition - Cont...@vmbuild
[continuum] BUILD FAILURE: Continuum (trunk) - Continuum :: Webapp Tests - Default Maven 2 Build Definition - Cont...@vmbuild
[continuum] BUILD SUCCESSFUL: Continuum (trunk) - Apache Continuum - - Cont...@vmbuild
[continuum] BUILD SUCCESSFUL: Continuum (trunk) - Continuum :: Project - - Cont...@vmbuild
[continuum] BUILD FAILURE: Continuum (trunk) - Continuum :: Webapp Tests - Default Maven 2 Build Definition - Cont...@vmbuild
[continuum] BUILD FAILURE: Continuum (trunk) - Continuum :: Webapp Tests - Default Maven 2 Build Definition - Cont...@vmbuild
[continuum] BUILD FAILURE: Continuum (trunk) - Continuum :: Webapp Tests - Default Maven 2 Build Definition - Cont...@vmbuild
[continuum] BUILD FAILURE: Continuum (trunk) - Continuum :: Webapp Tests - - Cont...@vmbuild
[continuum] BUILD SUCCESSFUL: Continuum (trunk) - Continuum :: Webapp Tests - - Cont...@vmbuild
[continuum] BUILD FAILURE: Continuum (trunk) - Continuum :: Project - - Cont...@vmbuild
[continuum] BUILD SUCCESSFUL: Continuum (trunk) - Continuum :: Project - - Cont...@vmbuild