81 messages

org.apache.continuum.notifications [All Lists]

2012 May [All Months]

Page 1 (Messages 1 to 25): 1 2 3 4

[continuum] BUILD ERROR: Continuum (trunk) - Continuum :: Project - Default Maven 2 Build Definition - Cont...@vmbuild
[continuum] BUILD FAILURE: Continuum (trunk) - Continuum :: Project - Default Maven 2 Build Definition - Cont...@vmbuild
[continuum] BUILD FAILURE: Continuum (trunk) - Continuum :: Project - Default Maven 2 Build Definition - Cont...@vmbuild
[continuum] BUILD FAILURE: Continuum (trunk) - Continuum :: Project - Default Maven 2 Build Definition - Cont...@vmbuild
[continuum] BUILD FAILURE: Continuum (trunk) - Continuum :: Project - Default Maven 2 Build Definition - Cont...@vmbuild
[continuum] BUILD ERROR: Continuum (trunk) - Continuum :: Project - Default Maven 2 Build Definition - Cont...@vmbuild
[continuum] BUILD FAILURE: Continuum (trunk) - Continuum :: Project - Default Maven 2 Build Definition - Cont...@vmbuild
[continuum] BUILD ERROR: Continuum (trunk) - Continuum :: Project - Default Maven 2 Build Definition - Cont...@vmbuild
[continuum] BUILD ERROR: Continuum (trunk) - Continuum :: Project - Default Maven 2 Build Definition - Cont...@vmbuild
[continuum] BUILD ERROR: Continuum (trunk) - Continuum :: Project - Default Maven 2 Build Definition - Cont...@vmbuild
[continuum] BUILD FAILURE: Continuum (trunk) - Continuum :: Project - Default Maven 2 Build Definition - Cont...@vmbuild
[continuum] BUILD FAILURE: Continuum (trunk) - Continuum :: Project - Default Maven 2 Build Definition - Cont...@vmbuild
[continuum] BUILD ERROR: Continuum (trunk) - Continuum :: Project - Default Maven 2 Build Definition - Cont...@vmbuild
[continuum] BUILD FAILURE: Continuum (trunk) - Continuum :: Project - Default Maven 2 Build Definition - Cont...@vmbuild
[continuum] BUILD FAILURE: Continuum (trunk) - Continuum :: Project - Default Maven 2 Build Definition - Cont...@vmbuild
[continuum] BUILD FAILURE: Continuum (trunk) - Continuum :: Project - Default Maven 2 Build Definition - Cont...@vmbuild
[continuum] BUILD FAILURE: Continuum (trunk) - Continuum :: Project - Default Maven 2 Build Definition - Cont...@vmbuild
[continuum] BUILD ERROR: Continuum (trunk) - Continuum :: Project - Default Maven 2 Build Definition - Cont...@vmbuild
[continuum] BUILD FAILURE: Continuum (trunk) - Continuum :: Project - Default Maven 2 Build Definition - Cont...@vmbuild
[continuum] BUILD ERROR: Continuum (trunk) - Continuum :: Project - Default Maven 2 Build Definition - Cont...@vmbuild
[continuum] BUILD ERROR: Continuum (trunk) - Continuum :: Project - Default Maven 2 Build Definition - Cont...@vmbuild
[continuum] BUILD FAILURE: Continuum (trunk) - Continuum :: Project - Default Maven 2 Build Definition - Cont...@vmbuild
[continuum] BUILD ERROR: Continuum (trunk) - Continuum :: Project - Default Maven 2 Build Definition - Cont...@vmbuild
[continuum] BUILD ERROR: Continuum (trunk) - Continuum :: Project - Default Maven 2 Build Definition - Cont...@vmbuild
[continuum] BUILD FAILURE: Continuum (trunk) - Continuum :: Project - Default Maven 2 Build Definition - Cont...@vmbuild

Page 1 (Messages 1 to 25): 1 2 3 4