48 messages

org.apache.continuum.notifications [All Lists]

2010 June [All Months]

Page 1 (Messages 1 to 25): 1 2

[continuum] BUILD SUCCESSFUL: Continuum - Continuum :: Release System - Maven 2.0.9, Java 5 - Cont...@vmbuild.apache.org
[continuum] BUILD SUCCESSFUL: Continuum - Continuum :: Core - Maven 2.0.9, Java 5 - Cont...@vmbuild.apache.org
[continuum] BUILD FAILURE: Continuum - Continuum :: Web APP - Maven 2.0.9, Java 5 - Cont...@vmbuild.apache.org
[continuum] BUILD FAILURE: Continuum - Continuum :: Web APP - Maven 2.0.9, Java 5 - Cont...@vmbuild.apache.org
[continuum] BUILD SUCCESSFUL: Continuum - Continuum :: Configuration - Maven 2.0.9, Java 5 - Cont...@vmbuild.apache.org
[continuum] BUILD FAILURE: Continuum - Continuum :: Core - Maven 2.0.9, Java 5 - Cont...@vmbuild.apache.org
[continuum] BUILD FAILURE: Continuum - Continuum :: Web APP - Maven 2.0.9, Java 5 - Cont...@vmbuild.apache.org
[continuum] BUILD FAILURE: Continuum - Continuum :: Distributed Build :: Build Agent :: Core - Maven 2.0.9, Java 5 - Cont...@vmbuild.apache.org
[continuum] BUILD FAILURE: Continuum - Continuum :: Test - Maven 2.0.9, Java 5 - Cont...@vmbuild.apache.org
[continuum] BUILD FAILURE: Continuum - Continuum :: Commons - Maven 2.0.9, Java 5 - Cont...@vmbuild.apache.org
[continuum] BUILD FAILURE: Continuum - Continuum :: Distributed Build :: Build Agent :: Webapp - Maven 2.0.9, Java 5 - Cont...@vmbuild.apache.org
[continuum] BUILD FAILURE: Continuum - Continuum :: SCM - Maven 2.0.9, Java 5 - Cont...@vmbuild.apache.org
[continuum] BUILD FAILURE: Continuum - Continuum :: Web APP - Maven 2.0.9, Java 5 - Cont...@vmbuild.apache.org
[continuum] BUILD SUCCESSFUL: Continuum - Continuum :: Configuration - Maven 2.0.9, Java 5 - Cont...@vmbuild.apache.org
[continuum] BUILD SUCCESSFUL: Continuum - Continuum :: Test - Maven 2.0.9, Java 5 - Cont...@vmbuild.apache.org
[continuum] BUILD SUCCESSFUL: Continuum - Continuum :: Store - Maven 2.0.9, Java 5 - Cont...@vmbuild.apache.org
[continuum] BUILD SUCCESSFUL: Continuum - Continuum :: Reports - Maven 2.0.9, Java 5 - Cont...@vmbuild.apache.org
[continuum] BUILD SUCCESSFUL: Continuum - Continuum :: Core - Maven 2.0.9, Java 5 - Cont...@vmbuild.apache.org
[continuum] BUILD SUCCESSFUL: Continuum - Continuum :: Wagon Notifier - Maven 2.0.9, Java 5 - Cont...@vmbuild.apache.org
[continuum] BUILD FAILURE: Continuum - Continuum :: Distributed Build :: Build Agent :: Webapp - Maven 2.0.9, Java 5 - Cont...@vmbuild.apache.org
[continuum] BUILD FAILURE: Continuum - Continuum :: Web APP - Maven 2.0.9, Java 5 - Cont...@vmbuild.apache.org
[continuum] BUILD FAILURE: Continuum - Continuum :: Web APP - Maven 2.0.9, Java 5 - Cont...@vmbuild.apache.org
[continuum] BUILD FAILURE: Continuum - Continuum :: Web APP - Maven 2.0.9, Java 5 - Cont...@vmbuild.apache.org
[continuum] BUILD FAILURE: Continuum - Continuum :: Web APP - Maven 2.0.9, Java 5 - Cont...@vmbuild.apache.org
[continuum] BUILD FAILURE: Continuum - Continuum :: Distributed Build :: Build Agent :: Webapp - Maven 2.0.9, Java 5 - Cont...@vmbuild.apache.org

Page 1 (Messages 1 to 25): 1 2