598 messages

org.apache.continuum.notifications [All Lists]

2010 March [All Months]

Page 6 (Messages 126 to 150): 1 2 3 4 5 6 7 8 9 10 11 12 13 14 15 16 17 18 19 20 21 22 23 24

[continuum] BUILD FAILURE: Continuum 1.3.X - Continuum :: Project - default maven2 buildDefinition - Cont...@vmbuild.apache.org
[continuum] BUILD ERROR: Continuum 1.3.X - Continuum :: Wagon Notifier - default maven2 buildDefinition - Cont...@vmbuild.apache.org
[continuum] BUILD ERROR: Continuum 1.3.X - Continuum :: XMLRPC :: Backup Tool - default maven2 buildDefinition - Cont...@vmbuild.apache.org
[continuum] BUILD ERROR: Continuum 1.3.X - Continuum :: Redback :: Legacy Model - default maven2 buildDefinition - Cont...@vmbuild.apache.org
[continuum] BUILD ERROR: Continuum 1.3.X - Continuum :: Distributed Build :: Build Agent :: Webapp - default maven2 buildDefinition - Cont...@vmbuild.apache.org
[continuum] BUILD FAILURE: Continuum 1.3.X - Continuum :: IRC Notifier - default maven2 buildDefinition - Cont...@vmbuild.apache.org
[continuum] BUILD FAILURE: Continuum 1.3.X - Continuum :: XMLRPC :: Backup Tool - default maven2 buildDefinition - Cont...@vmbuild.apache.org
[continuum] BUILD ERROR: Continuum 1.3.X - Continuum :: Core - default maven2 buildDefinition - Cont...@vmbuild.apache.org
[continuum] BUILD FAILURE: Continuum 1.3.X - Continuum :: Commons - default maven2 buildDefinition - Cont...@vmbuild.apache.org
[continuum] BUILD ERROR: Continuum 1.3.X - Apache Continuum - default maven2 buildDefinition - Cont...@vmbuild.apache.org
[continuum] BUILD ERROR: Continuum 1.3.X - Continuum :: Test - default maven2 buildDefinition - Cont...@vmbuild.apache.org
[continuum] BUILD FAILURE: Continuum 1.3.X - Continuum :: Distributed Build :: Transport :: Slave - default maven2 buildDefinition - Cont...@vmbuild.apache.org
[continuum] BUILD FAILURE: Continuum 1.3.X - Continuum :: Jabber Notifier - default maven2 buildDefinition - Cont...@vmbuild.apache.org
[continuum] BUILD FAILURE: Continuum 1.3.X - Continuum :: Wagon Notifier - default maven2 buildDefinition - Cont...@vmbuild.apache.org
[continuum] BUILD FAILURE: Continuum 1.3.X - Continuum :: XMLRPC :: API - default maven2 buildDefinition - Cont...@vmbuild.apache.org
[continuum] BUILD FAILURE: Continuum 1.3.X - Continuum :: Data Management :: Redback JDO - default maven2 buildDefinition - Cont...@vmbuild.apache.org
[continuum] BUILD FAILURE: Continuum 1.3.X - Continuum :: Test - default maven2 buildDefinition - Cont...@vmbuild.apache.org
[continuum] BUILD FAILURE: Continuum 1.3.X - Continuum :: Purge System - default maven2 buildDefinition - Cont...@vmbuild.apache.org
[continuum] BUILD ERROR: Continuum 1.3.X - Continuum :: Legacy Model - default maven2 buildDefinition - Cont...@vmbuild.apache.org
[continuum] BUILD ERROR: Continuum 1.3.X - Continuum :: Distributed Build :: Build Agent API - default maven2 buildDefinition - Cont...@vmbuild.apache.org
[continuum] BUILD ERROR: Continuum 1.3.X - Continuum :: Distributed Build :: Build Agent :: Webapp - default maven2 buildDefinition - Cont...@vmbuild.apache.org
[continuum] BUILD ERROR: Continuum 1.3.X - Continuum :: Wagon Notifier - default maven2 buildDefinition - Cont...@vmbuild.apache.org
[continuum] BUILD ERROR: Continuum 1.3.X - Continuum :: XMLRPC :: Backup Tool - default maven2 buildDefinition - Cont...@vmbuild.apache.org
[continuum] BUILD SUCCESSFUL: Continuum 1.3.X - Continuum :: Base - default maven2 buildDefinition - Cont...@vmbuild.apache.org
[continuum] BUILD SUCCESSFUL: Continuum 1.3.X - Continuum :: Legacy Model - default maven2 buildDefinition - Cont...@vmbuild.apache.org

Page 6 (Messages 126 to 150): 1 2 3 4 5 6 7 8 9 10 11 12 13 14 15 16 17 18 19 20 21 22 23 24