598 messages

org.apache.continuum.notifications [All Lists]

2010 March [All Months]

Page 23 (Messages 551 to 575): 1 2 3 4 5 6 7 8 9 10 11 12 13 14 15 16 17 18 19 20 21 22 23 24

[continuum] BUILD ERROR: Continuum 1.3.X - Continuum :: Reports - default maven2 buildDefinition - Cont...@vmbuild.apache.org
[continuum] BUILD ERROR: Continuum 1.3.X - Continuum :: Distributed Build :: Transport :: Master :: API - default maven2 buildDefinition - Cont...@vmbuild.apache.org
[continuum] BUILD ERROR: Continuum 1.3.X - Continuum :: XMLRPC :: Client - default maven2 buildDefinition - Cont...@vmbuild.apache.org
[continuum] BUILD FAILURE: Continuum 1.3.X - Continuum :: Distributed Build :: Build Agent API - default maven2 buildDefinition - Cont...@vmbuild.apache.org
[continuum] BUILD FAILURE: Continuum 1.3.X - Apache Continuum - default maven2 buildDefinition - Cont...@vmbuild.apache.org
[continuum] BUILD FAILURE: Continuum 1.3.X - Continuum :: Distributed Build :: Build Agent :: Core - default maven2 buildDefinition - Cont...@vmbuild.apache.org
[continuum] BUILD FAILURE: Continuum 1.3.X - Continuum :: Security - default maven2 buildDefinition - Cont...@vmbuild.apache.org
[continuum] BUILD FAILURE: Continuum 1.3.X - Continuum :: Jabber Notifier - default maven2 buildDefinition - Cont...@vmbuild.apache.org
[continuum] BUILD FAILURE: Continuum 1.3.X - Continuum :: Legacy Model - default maven2 buildDefinition - Cont...@vmbuild.apache.org
[continuum] BUILD ERROR: Continuum 1.3.X - Continuum :: Distributed Build :: Transport :: Master :: Client - default maven2 buildDefinition - Cont...@vmbuild.apache.org
[continuum] BUILD ERROR: Continuum 1.3.X - Continuum :: Security - default maven2 buildDefinition - Cont...@vmbuild.apache.org
[continuum] BUILD FAILURE: Continuum 1.3.X - Continuum :: API - default maven2 buildDefinition - Cont...@vmbuild.apache.org
[continuum] BUILD FAILURE: Continuum 1.3.X - Continuum :: Reports - default maven2 buildDefinition - Cont...@vmbuild.apache.org
[continuum] BUILD ERROR: Continuum 1.3.X - Continuum :: Jabber Notifier - default maven2 buildDefinition - Cont...@vmbuild.apache.org
[continuum] BUILD ERROR: Continuum 1.3.X - Continuum :: Distributed Build :: Transport :: Master :: API - default maven2 buildDefinition - Cont...@vmbuild.apache.org
[continuum] BUILD ERROR: Continuum 1.3.X - Continuum :: Data Management :: JDO - default maven2 buildDefinition - Cont...@vmbuild.apache.org
[continuum] BUILD FAILURE: Continuum 1.3.X - Apache Continuum Build Agent - default maven2 buildDefinition - Cont...@vmbuild.apache.org
[continuum] BUILD FAILURE: Continuum 1.3.X - Continuum :: Notifiers - default maven2 buildDefinition - Cont...@vmbuild.apache.org
[continuum] BUILD ERROR: Continuum 1.3.X - Continuum :: Builder - default maven2 buildDefinition - Cont...@vmbuild.apache.org
[continuum] BUILD ERROR: Continuum 1.3.X - Continuum :: Data Management :: JDO - default maven2 buildDefinition - Cont...@vmbuild.apache.org
[continuum] BUILD FAILURE: Continuum 1.3.X - Continuum :: Data Management :: CLI - default maven2 buildDefinition - Cont...@vmbuild.apache.org
[continuum] BUILD FAILURE: Continuum 1.3.X - Continuum :: Distributed Build :: Build Agent :: Webapp - default maven2 buildDefinition - Cont...@vmbuild.apache.org
[continuum] BUILD SUCCESSFUL: Continuum 1.3.X - Continuum :: Security - default maven2 buildDefinition - Cont...@vmbuild.apache.org
[continuum] BUILD SUCCESSFUL: Continuum 1.3.X - Continuum :: Distributed Build :: Transport :: Slave - default maven2 buildDefinition - Cont...@vmbuild.apache.org
[continuum] BUILD SUCCESSFUL: Continuum - Continuum :: Core - Maven 2.0.9, Java 5 - Cont...@vmbuild.apache.org

Page 23 (Messages 551 to 575): 1 2 3 4 5 6 7 8 9 10 11 12 13 14 15 16 17 18 19 20 21 22 23 24