598 messages

org.apache.continuum.notifications [All Lists]

2010 March [All Months]

Page 21 (Messages 501 to 525): 1 2 3 4 5 6 7 8 9 10 11 12 13 14 15 16 17 18 19 20 21 22 23 24

[continuum] BUILD ERROR: Continuum 1.3.X - Continuum :: Base - default maven2 buildDefinition - Cont...@vmbuild.apache.org
[continuum] BUILD ERROR: Continuum 1.3.X - Continuum :: SCM - default maven2 buildDefinition - Cont...@vmbuild.apache.org
[continuum] BUILD FAILURE: Continuum 1.3.X - Continuum :: Release System - default maven2 buildDefinition - Cont...@vmbuild.apache.org
[continuum] BUILD ERROR: Continuum 1.3.X - Continuum :: Store - default maven2 buildDefinition - Cont...@vmbuild.apache.org
[continuum] BUILD FAILURE: Continuum 1.3.X - Continuum :: Configuration - default maven2 buildDefinition - Cont...@vmbuild.apache.org
[continuum] BUILD FAILURE: Continuum 1.3.X - Continuum :: Builder - default maven2 buildDefinition - Cont...@vmbuild.apache.org
[continuum] BUILD FAILURE: Continuum 1.3.X - Continuum :: Data Management :: Redback JDO - default maven2 buildDefinition - Cont...@vmbuild.apache.org
[continuum] BUILD ERROR: Continuum 1.3.X - Continuum :: Base - default maven2 buildDefinition - Cont...@vmbuild.apache.org
[continuum] BUILD ERROR: Continuum 1.3.X - Continuum :: Release System - default maven2 buildDefinition - Cont...@vmbuild.apache.org
[continuum] BUILD ERROR: Continuum 1.3.X - Continuum :: Data Management :: API - default maven2 buildDefinition - Cont...@vmbuild.apache.org
[continuum] BUILD ERROR: Continuum 1.3.X - Continuum :: Distributed Build :: Build Agent - default maven2 buildDefinition - Cont...@vmbuild.apache.org
[continuum] BUILD FAILURE: Continuum 1.3.X - Continuum :: Distributed Build :: Build Agent - default maven2 buildDefinition - Cont...@vmbuild.apache.org
[continuum] BUILD ERROR: Continuum 1.3.X - Continuum :: Distributed Build :: Transport :: Slave :: Server - default maven2 buildDefinition - Cont...@vmbuild.apache.org
[continuum] BUILD ERROR: Continuum 1.3.X - Continuum :: Base - default maven2 buildDefinition - Cont...@vmbuild.apache.org
[continuum] BUILD ERROR: Continuum 1.3.X - Continuum :: Distributed Build :: Transport :: Slave :: Client - default maven2 buildDefinition - Cont...@vmbuild.apache.org
[continuum] BUILD ERROR: Continuum 1.3.X - Continuum :: XMLRPC :: Backup Tool - default maven2 buildDefinition - Cont...@vmbuild.apache.org
[continuum] BUILD FAILURE: Continuum 1.3.X - Continuum :: Notifier API - default maven2 buildDefinition - Cont...@vmbuild.apache.org
[continuum] BUILD ERROR: Continuum 1.3.X - Continuum :: Distributed Build :: Transport :: Slave :: Server - default maven2 buildDefinition - Cont...@vmbuild.apache.org
[continuum] BUILD ERROR: Continuum 1.3.X - Continuum :: Builder - default maven2 buildDefinition - Cont...@vmbuild.apache.org
[continuum] BUILD ERROR: Continuum 1.3.X - Continuum :: XMLRPC :: Server - default maven2 buildDefinition - Cont...@vmbuild.apache.org
[continuum] BUILD FAILURE: Continuum 1.3.X - Continuum :: SCM - default maven2 buildDefinition - Cont...@vmbuild.apache.org
[continuum] BUILD FAILURE: Continuum 1.3.X - Continuum :: Purge System - default maven2 buildDefinition - Cont...@vmbuild.apache.org
[continuum] BUILD ERROR: Continuum 1.3.X - Continuum :: Distributed Build :: Transport :: Slave :: Client - default maven2 buildDefinition - Cont...@vmbuild.apache.org
[continuum] BUILD FAILURE: Continuum 1.3.X - Continuum :: Distributed Build :: Build Agent :: Core - default maven2 buildDefinition - Cont...@vmbuild.apache.org
[continuum] BUILD FAILURE: Continuum - Continuum :: Web APP - Maven 2.0.9, Java 5 - Cont...@vmbuild.apache.org

Page 21 (Messages 501 to 525): 1 2 3 4 5 6 7 8 9 10 11 12 13 14 15 16 17 18 19 20 21 22 23 24