598 messages

org.apache.continuum.notifications [All Lists]

2010 March [All Months]

Page 12 (Messages 276 to 300): 1 2 3 4 5 6 7 8 9 10 11 12 13 14 15 16 17 18 19 20 21 22 23 24

[continuum] BUILD ERROR: Continuum 1.3.X - Continuum :: Distributed Build :: Transport :: Master - default maven2 buildDefinition - Cont...@vmbuild.apache.org
[continuum] BUILD ERROR: Continuum 1.3.X - Continuum :: Data Management :: Redback JDO - default maven2 buildDefinition - Cont...@vmbuild.apache.org
[continuum] BUILD ERROR: Continuum 1.3.X - Continuum :: Distributed Build :: Build Agent - default maven2 buildDefinition - Cont...@vmbuild.apache.org
[continuum] BUILD ERROR: Continuum 1.3.X - Continuum :: Test - default maven2 buildDefinition - Cont...@vmbuild.apache.org
[continuum] BUILD ERROR: Continuum 1.3.X - Continuum :: Wagon Notifier - default maven2 buildDefinition - Cont...@vmbuild.apache.org
[continuum] BUILD FAILURE: Continuum 1.3.X - Continuum :: Model - default maven2 buildDefinition - Cont...@vmbuild.apache.org
[continuum] BUILD FAILURE: Continuum 1.3.X - Continuum :: Base - default maven2 buildDefinition - Cont...@vmbuild.apache.org
[continuum] BUILD FAILURE: Continuum 1.3.X - Continuum :: XMLRPC :: Server - default maven2 buildDefinition - Cont...@vmbuild.apache.org
[continuum] BUILD ERROR: Continuum 1.3.X - Continuum :: Distributed Build :: Build Agent :: Webapp - default maven2 buildDefinition - Cont...@vmbuild.apache.org
[continuum] BUILD FAILURE: Continuum 1.3.X - Continuum :: Base - default maven2 buildDefinition - Cont...@vmbuild.apache.org
[continuum] BUILD ERROR: Continuum 1.3.X - Continuum :: Distributed Build :: Build Agent :: Core - default maven2 buildDefinition - Cont...@vmbuild.apache.org
[continuum] BUILD ERROR: Continuum 1.3.X - Continuum :: Distributed Build :: Transport :: Master - default maven2 buildDefinition - Cont...@vmbuild.apache.org
[continuum] BUILD FAILURE: Continuum 1.3.X - Continuum :: Distributed Build :: Transport :: Slave :: Server - default maven2 buildDefinition - Cont...@vmbuild.apache.org
[continuum] BUILD FAILURE: Continuum 1.3.X - Continuum :: Base - default maven2 buildDefinition - Cont...@vmbuild.apache.org
[continuum] BUILD FAILURE: Continuum 1.3.X - Continuum :: Data Management :: Parent - default maven2 buildDefinition - Cont...@vmbuild.apache.org
[continuum] BUILD ERROR: Continuum 1.3.X - Continuum :: Distributed Build :: Transport :: Slave :: Client - default maven2 buildDefinition - Cont...@vmbuild.apache.org
[continuum] BUILD ERROR: Continuum 1.3.X - Continuum :: Distributed Build :: Transport :: Master :: API - default maven2 buildDefinition - Cont...@vmbuild.apache.org
[continuum] BUILD ERROR: Continuum 1.3.X - Continuum :: Documentation - default maven2 buildDefinition - Cont...@vmbuild.apache.org
[continuum] BUILD ERROR: Continuum 1.3.X - Continuum :: MSN Notifier - default maven2 buildDefinition - Cont...@vmbuild.apache.org
[continuum] BUILD FAILURE: Continuum 1.3.X - Continuum :: Distributed Build :: Build Agent - default maven2 buildDefinition - Cont...@vmbuild.apache.org
[continuum] BUILD SUCCESSFUL: Continuum 1.3.X - Continuum :: Project - default maven2 buildDefinition - Cont...@vmbuild.apache.org
[continuum] BUILD SUCCESSFUL: Continuum 1.3.X - Continuum :: Reports - default maven2 buildDefinition - Cont...@vmbuild.apache.org
[continuum] BUILD SUCCESSFUL: Continuum 1.3.X - Continuum :: Notifiers - default maven2 buildDefinition - Cont...@vmbuild.apache.org
[continuum] BUILD SUCCESSFUL: Continuum - Continuum :: Web APP - Maven 2.0.9, Java 5 - Cont...@vmbuild.apache.org
[continuum] BUILD SUCCESSFUL: Continuum - Continuum :: Project - Maven 2.0.9, Java 5 - Cont...@vmbuild.apache.org

Page 12 (Messages 276 to 300): 1 2 3 4 5 6 7 8 9 10 11 12 13 14 15 16 17 18 19 20 21 22 23 24