598 messages

org.apache.continuum.notifications [All Lists]

2010 March [All Months]

Page 10 (Messages 226 to 250): 1 2 3 4 5 6 7 8 9 10 11 12 13 14 15 16 17 18 19 20 21 22 23 24

[continuum] BUILD ERROR: Continuum 1.3.X - Continuum :: Configuration - default maven2 buildDefinition - Cont...@vmbuild.apache.org
[continuum] BUILD FAILURE: Continuum 1.3.X - Continuum :: Distributed Build :: Transport :: Master :: Client - default maven2 buildDefinition - Cont...@vmbuild.apache.org
[continuum] BUILD FAILURE: Continuum 1.3.X - Continuum :: Configuration - default maven2 buildDefinition - Cont...@vmbuild.apache.org
[continuum] BUILD ERROR: Continuum 1.3.X - Continuum :: API - default maven2 buildDefinition - Cont...@vmbuild.apache.org
[continuum] BUILD ERROR: Continuum 1.3.X - Continuum :: Notifier API - default maven2 buildDefinition - Cont...@vmbuild.apache.org
[continuum] BUILD ERROR: Continuum 1.3.X - Continuum :: XMLRPC :: API - default maven2 buildDefinition - Cont...@vmbuild.apache.org
[continuum] BUILD FAILURE: Continuum 1.3.X - Continuum :: Distributed Build :: Transport :: Slave - default maven2 buildDefinition - Cont...@vmbuild.apache.org
[continuum] BUILD FAILURE: Continuum 1.3.X - Continuum :: Data Management :: JDO - default maven2 buildDefinition - Cont...@vmbuild.apache.org
[continuum] BUILD ERROR: Continuum 1.3.X - Continuum :: Reports - default maven2 buildDefinition - Cont...@vmbuild.apache.org
[continuum] BUILD ERROR: Continuum 1.3.X - Continuum :: XMLRPC :: Parent - default maven2 buildDefinition - Cont...@vmbuild.apache.org
[continuum] BUILD ERROR: Continuum 1.3.X - Continuum :: Web APP - default maven2 buildDefinition - Cont...@vmbuild.apache.org
[continuum] BUILD ERROR: Continuum 1.3.X - Continuum :: Data Management :: JDO - default maven2 buildDefinition - Cont...@vmbuild.apache.org
[continuum] BUILD FAILURE: Continuum 1.3.X - Continuum :: Store - default maven2 buildDefinition - Cont...@vmbuild.apache.org
[continuum] BUILD ERROR: Continuum 1.3.X - Continuum :: Distributed Build :: Transport :: Master :: Client - default maven2 buildDefinition - Cont...@vmbuild.apache.org
[continuum] BUILD ERROR: Continuum 1.3.X - Continuum :: Web APP - default maven2 buildDefinition - Cont...@vmbuild.apache.org
[continuum] BUILD ERROR: Continuum 1.3.X - Continuum :: Documentation - default maven2 buildDefinition - Cont...@vmbuild.apache.org
[continuum] BUILD ERROR: Continuum 1.3.X - Continuum :: Distributed Build :: Build Agent API - default maven2 buildDefinition - Cont...@vmbuild.apache.org
[continuum] BUILD FAILURE: Continuum 1.3.X - Continuum :: Distributed Build :: Transport :: Slave :: API - default maven2 buildDefinition - Cont...@vmbuild.apache.org
[continuum] BUILD FAILURE: Continuum 1.3.X - Continuum :: Builder - default maven2 buildDefinition - Cont...@vmbuild.apache.org
[continuum] BUILD ERROR: Continuum 1.3.X - Continuum :: Notifier API - default maven2 buildDefinition - Cont...@vmbuild.apache.org
[continuum] BUILD ERROR: Continuum 1.3.X - Continuum :: IRC Notifier - default maven2 buildDefinition - Cont...@vmbuild.apache.org
[continuum] BUILD FAILURE: Continuum 1.3.X - Apache Continuum - default maven2 buildDefinition - Cont...@vmbuild.apache.org
[continuum] BUILD FAILURE: Continuum 1.3.X - Continuum :: Store - default maven2 buildDefinition - Cont...@vmbuild.apache.org
[continuum] BUILD FAILURE: Continuum 1.3.X - Continuum :: Documentation - default maven2 buildDefinition - Cont...@vmbuild.apache.org
[continuum] BUILD SUCCESSFUL: Continuum 1.3.X - Continuum :: Data Management :: Parent - default maven2 buildDefinition - Cont...@vmbuild.apache.org

Page 10 (Messages 226 to 250): 1 2 3 4 5 6 7 8 9 10 11 12 13 14 15 16 17 18 19 20 21 22 23 24