264 messages

org.apache.continuum.notifications [All Lists]

2009 April [All Months]

Page 9 (Messages 201 to 225): 1 2 3 4 5 6 7 8 9 10 11

[continuum] BUILD FAILURE: Continuum - Continuum :: Data Management :: API - Maven 2.0.9, Java 5 - Cont...@vmbuild.apache.org
[continuum] BUILD FAILURE: Continuum - Continuum :: Distributed Build :: Build Agent - Maven 2.0.9, Java 5 - Cont...@vmbuild.apache.org
[continuum] BUILD FAILURE: Continuum - Continuum :: Distributed Build :: Transport :: Slave - Maven 2.0.9, Java 5 - Cont...@vmbuild.apache.org
[continuum] BUILD SUCCESSFUL: Continuum - Continuum :: Distributed Build :: Transport :: Master - Maven 2.0.9, Java 5 - Cont...@vmbuild.apache.org
[continuum] BUILD FAILURE: Continuum - Continuum :: Web APP - Maven 2.0.9, Java 5 - Cont...@vmbuild.apache.org
[continuum] BUILD SUCCESSFUL: Continuum - Continuum :: Configuration - Maven 2.0.9, Java 5 - Cont...@vmbuild.apache.org
[continuum] BUILD FAILURE: Continuum - Continuum Webapp Test - Maven 2.0.9, Java 5 - Cont...@vmbuild.apache.org
[continuum] BUILD FAILURE: Continuum - Continuum Webapp Test - Maven 2.0.9, Java 5 - Cont...@vmbuild.apache.org
[continuum] BUILD FAILURE: Continuum - Continuum :: Distributed Build :: Build Agent :: Core - Maven 2.0.9, Java 5 - Cont...@vmbuild.apache.org
[continuum] BUILD SUCCESSFUL: Continuum 1.3.x Branch - Continuum :: Commons - default maven2 buildDefinition - Cont...@vmbuild.apache.org
[continuum] BUILD FAILURE: Continuum - Continuum :: Commons - Maven 2.0.9, Java 5 - Cont...@vmbuild.apache.org
[continuum] BUILD FAILURE: Continuum - Continuum Webapp Test - Maven 2.0.9, Java 5 - Cont...@vmbuild.apache.org
[continuum] BUILD FAILURE: Continuum 1.3.x Branch - Continuum :: Builder - default maven2 buildDefinition - Cont...@vmbuild.apache.org
[continuum] BUILD SUCCESSFUL: Continuum - Continuum :: Notifiers - Maven 2.0.9, Java 5 - Cont...@vmbuild.apache.org
[continuum] BUILD FAILURE: Continuum - Continuum Webapp Test - Maven 2.0.9, Java 5 - Cont...@vmbuild.apache.org
[continuum] BUILD FAILURE: Continuum - Continuum :: Configuration - Maven 2.0.9, Java 5 - Cont...@vmbuild.apache.org
[continuum] BUILD FAILURE: Continuum 1.3.x Branch - Continuum :: Distributed Build :: Build Agent :: Core - default maven2 buildDefinition - Cont...@vmbuild.apache.org
[continuum] BUILD FAILURE: Continuum - Continuum :: Distributed Build :: Build Agent :: Core - Maven 2.0.9, Java 5 - Cont...@vmbuild.apache.org
[continuum] BUILD FAILURE: Continuum 1.3.x Branch - Continuum :: Distributed Build :: Transport :: Master :: Client - default maven2 buildDefinition - Cont...@vmbuild.apache.org
[continuum] BUILD FAILURE: Continuum - Continuum :: Distributed Build :: Transport :: Slave :: API - Maven 2.0.9, Java 5 - Cont...@vmbuild.apache.org
[continuum] BUILD FAILURE: Continuum 1.3.x Branch - Continuum :: Data Management :: JDO - default maven2 buildDefinition - Cont...@vmbuild.apache.org
[continuum] BUILD SUCCESSFUL: Continuum 1.3.x Branch - Apache Continuum - default maven2 buildDefinition - Cont...@vmbuild.apache.org
[continuum] BUILD SUCCESSFUL: Continuum - Continuum :: Builder - Maven 2.0.9, Java 5 - Cont...@vmbuild.apache.org
[continuum] BUILD SUCCESSFUL: Continuum 1.3.x Branch - Continuum :: Distributed Build :: Transport :: Master :: Client - default maven2 buildDefinition - Cont...@vmbuild.apache.org
[continuum] BUILD SUCCESSFUL: Continuum - Continuum :: Legacy Model - Maven 2.0.9, Java 5 - Cont...@vmbuild.apache.org

Page 9 (Messages 201 to 225): 1 2 3 4 5 6 7 8 9 10 11