264 messages

org.apache.continuum.notifications [All Lists]

2009 April [All Months]

Page 8 (Messages 176 to 200): 1 2 3 4 5 6 7 8 9 10 11

[continuum] BUILD FAILURE: Continuum - Continuum :: IRC Notifier - Maven 2.0.9, Java 5 - Cont...@vmbuild.apache.org
[continuum] BUILD FAILURE: Continuum - Continuum :: API - Maven 2.0.9, Java 5 - Cont...@vmbuild.apache.org
[continuum] BUILD FAILURE: Continuum - Continuum :: Data Management :: Redback JDO - Maven 2.0.9, Java 5 - Cont...@vmbuild.apache.org
[continuum] BUILD FAILURE: Continuum - Continuum :: Store - Maven 2.0.9, Java 5 - Cont...@vmbuild.apache.org
[continuum] BUILD SUCCESSFUL: Continuum - Continuum :: Distributed Build :: Transport :: Slave - Maven 2.0.9, Java 5 - Cont...@vmbuild.apache.org
[continuum] BUILD SUCCESSFUL: Continuum - Continuum :: API - Maven 2.0.9, Java 5 - Cont...@vmbuild.apache.org
[continuum] BUILD FAILURE: Continuum - Continuum :: Builder - Maven 2.0.9, Java 5 - Cont...@vmbuild.apache.org
[continuum] BUILD SUCCESSFUL: Continuum - Continuum :: Legacy Model - Maven 2.0.9, Java 5 - Cont...@vmbuild.apache.org
[continuum] BUILD FAILURE: Continuum - Continuum :: Wagon Notifier - Maven 2.0.9, Java 5 - Cont...@vmbuild.apache.org
[continuum] BUILD SUCCESSFUL: Continuum - Continuum :: Release System - Maven 2.0.9, Java 5 - Cont...@vmbuild.apache.org
[continuum] BUILD SUCCESSFUL: Continuum - Continuum :: Reports - Maven 2.0.9, Java 5 - Cont...@vmbuild.apache.org
[continuum] BUILD SUCCESSFUL: Continuum - Continuum :: Core - Maven 2.0.9, Java 5 - Cont...@vmbuild.apache.org
[continuum] BUILD SUCCESSFUL: Continuum - Continuum :: Web APP - Maven 2.0.9, Java 5 - Cont...@vmbuild.apache.org
[continuum] BUILD SUCCESSFUL: Continuum - Continuum :: Core - Maven 2.0.9, Java 5 - Cont...@vmbuild.apache.org
[continuum] BUILD ERROR: Continuum - Continuum Webapp Test - Maven 2.0.9, Java 5 - Cont...@vmbuild.apache.org
[continuum] BUILD SUCCESSFUL: Continuum 1.3.x Branch - Continuum :: Core - default maven2 buildDefinition - Cont...@vmbuild.apache.org
[continuum] BUILD FAILURE: Continuum - Continuum Webapp Test - Maven 2.0.9, Java 5 - Cont...@vmbuild.apache.org
[continuum] BUILD FAILURE: Continuum 1.3.x Branch - Apache Continuum - default maven2 buildDefinition - Cont...@vmbuild.apache.org
[continuum] BUILD FAILURE: Continuum - Continuum :: Distributed Build :: Transport :: Master :: Client - Maven 2.0.9, Java 5 - Cont...@vmbuild.apache.org
[continuum] BUILD FAILURE: Continuum 1.3.x Branch - Continuum :: Legacy Model - default maven2 buildDefinition - Cont...@vmbuild.apache.org
[continuum] BUILD SUCCESSFUL: Continuum - Continuum :: API - Maven 2.0.9, Java 5 - Cont...@vmbuild.apache.org
[continuum] BUILD SUCCESSFUL: Continuum 1.3.x Branch - Continuum :: Configuration - default maven2 buildDefinition - Cont...@vmbuild.apache.org
[continuum] BUILD SUCCESSFUL: Continuum 1.3.x Branch - Continuum :: Data Management :: Redback JDO - default maven2 buildDefinition - Cont...@vmbuild.apache.org
[continuum] BUILD SUCCESSFUL: Continuum 1.3.x Branch - Continuum :: Distributed Build :: Transport :: Master :: API - default maven2 buildDefinition - Cont...@vmbuild.apache.org
[continuum] BUILD SUCCESSFUL: Continuum - Continuum :: Distributed Build :: Transport :: Master :: Client - Maven 2.0.9, Java 5 - Cont...@vmbuild.apache.org

Page 8 (Messages 176 to 200): 1 2 3 4 5 6 7 8 9 10 11