264 messages

org.apache.continuum.notifications [All Lists]

2009 April [All Months]

Page 1 (Messages 1 to 25): 1 2 3 4 5 6 7 8 9 10 11

[continuum] BUILD FAILURE: Continuum - Continuum :: Jabber Notifier - Maven 2.0.9, Java 5 - Cont...@vmbuild.apache.org
[continuum] BUILD FAILURE: Continuum - Continuum :: MSN Notifier - Maven 2.0.9, Java 5 - Cont...@vmbuild.apache.org
[continuum] BUILD FAILURE: Continuum - Continuum :: Redback :: Legacy Model - Maven 2.0.9, Java 5 - Cont...@vmbuild.apache.org
[continuum] BUILD FAILURE: Continuum - Continuum :: Web APP - Maven 2.0.9, Java 5 - Cont...@vmbuild.apache.org
[continuum] BUILD FAILURE: Continuum - Continuum :: Reports - Maven 2.0.9, Java 5 - Cont...@vmbuild.apache.org
[continuum] BUILD FAILURE: Continuum - Continuum :: Purge System - Maven 2.0.9, Java 5 - Cont...@vmbuild.apache.org
[continuum] BUILD SUCCESSFUL: Continuum - Continuum :: Core - Maven 2.0.9, Java 5 - Cont...@vmbuild.apache.org
[continuum] BUILD FAILURE: Continuum - Continuum :: Web APP - Maven 2.0.9, Java 5 - Cont...@vmbuild.apache.org
[continuum] BUILD SUCCESSFUL: Continuum - Continuum :: Release System - Maven 2.0.9, Java 5 - Cont...@vmbuild.apache.org
[continuum] BUILD FAILURE: Continuum - Continuum Webapp Test - Maven 2.0.9, Java 5 - Cont...@vmbuild.apache.org
[continuum] BUILD SUCCESSFUL: Continuum - Continuum :: Data Management :: JDO - Maven 2.0.9, Java 5 - Cont...@vmbuild.apache.org
[continuum] BUILD FAILURE: Continuum - Continuum Webapp Test - Maven 2.0.9, Java 5 - Cont...@vmbuild.apache.org
[continuum] BUILD FAILURE: Continuum - Continuum Webapp Test - Maven 2.0.9, Java 5 - Cont...@vmbuild.apache.org
[continuum] BUILD FAILURE: Continuum - Continuum :: Core - Maven 2.0.9, Java 5 - Cont...@vmbuild.apache.org
[continuum] BUILD SUCCESSFUL: Continuum - Continuum :: Builder - Maven 2.0.9, Java 5 - Cont...@vmbuild.apache.org
[continuum] BUILD SUCCESSFUL: Continuum - Continuum :: Distributed Build :: Build Agent :: Core - Maven 2.0.9, Java 5 - Cont...@vmbuild.apache.org
[continuum] BUILD FAILURE: Continuum - Continuum Webapp Test - Maven 2.0.9, Java 5 - Cont...@vmbuild.apache.org
[continuum] BUILD FAILURE: Continuum - Continuum :: Commons - Maven 2.0.9, Java 5 - Cont...@vmbuild.apache.org
[continuum] BUILD SUCCESSFUL: Continuum - Continuum :: Commons - Maven 2.0.9, Java 5 - Cont...@vmbuild.apache.org
[continuum] BUILD FAILURE: Continuum - Continuum Webapp Test - Maven 2.0.9, Java 5 - Cont...@vmbuild.apache.org
[continuum] BUILD FAILURE: Continuum 1.3.x Branch - Continuum :: Distributed Build :: Build Agent :: Webapp - default maven2 buildDefinition - Cont...@vmbuild.apache.org
[continuum] BUILD SUCCESSFUL: Continuum - Continuum :: Data Management :: JDO - Maven 2.0.9, Java 5 - Cont...@vmbuild.apache.org
[continuum] BUILD SUCCESSFUL: Continuum - Continuum :: Distributed Build :: Transport :: Slave :: API - Maven 2.0.9, Java 5 - Cont...@vmbuild.apache.org
[continuum] BUILD SUCCESSFUL: Continuum 1.3.x Branch - Continuum :: Legacy Model - default maven2 buildDefinition - Cont...@vmbuild.apache.org
[continuum] BUILD SUCCESSFUL: Continuum 1.3.x Branch - Continuum :: Data Management :: CLI - default maven2 buildDefinition - Cont...@vmbuild.apache.org

Page 1 (Messages 1 to 25): 1 2 3 4 5 6 7 8 9 10 11