149 messages

net.java.openjdk.type-annotations-dev [All Lists]

2013 April [All Months]

Page 1 (Messages 1 to 25): 1 2 3 4 5 6

Re: Test fails with AssertionError - Werner Dietl
Problem with type annotations on a type parameter - Werner Dietl
Re: Test fails with AssertionError - Steve Sides
test case related to AssertionError (8009360) - Steve Sides
Re: test case related to AssertionError (8009360) - Steve Sides
type-annotations in inner in anonymous class - Steve Sides
waiting in line - Jonathan Gibbons
hg: type-annotations/type-annotations/jaxws: 2 new changesets - wdi...@gmail.com
Re: @ignored tests - Steve Sides
Re: @ignored tests - Jonathan Gibbons
Re: @ignored tests - Werner Dietl
hg: type-annotations/type-annotations/langtools: 8010015 by Steve Sides: test case for a fixed bug. - wdi...@gmail.com
hg: type-annotations/type-annotations/jdk: 36 new changesets - wdi...@gmail.com
Re: Problem with type annotations on a type parameter - Jonathan Gibbons
Re: Problem with type annotations on a type parameter - Jonathan Gibbons
Re: tests for "strange behavior" - Steve Sides
Re: Problem with type annotations on a type parameter - Jonathan Gibbons
Re: Problem with type annotations on a type parameter - Jonathan Gibbons
Re: test failures - Jonathan Gibbons
Re: test failures - Jonathan Gibbons
Re: test failures - Michael Ernst
Re: test failures - Werner Dietl
Re: Problem with type annotations on a type parameter - Werner Dietl
Re: test failures - Jonathan Gibbons
hg: type-annotations/type-annotations: 4 new changesets - wdi...@gmail.com

Page 1 (Messages 1 to 25): 1 2 3 4 5 6