atom feed2 messages in org.jboss.lists.jbossts-issues[jbossts-issues] [JBoss JIRA] (JBTM-1...
FromSent OnAttachments
Michael Musgrove (JIRA)Apr 19, 2013 2:48 am 
Michael Musgrove (JIRA)Apr 19, 2013 3:19 am 
Subject:[jbossts-issues] [JBoss JIRA] (JBTM-1560) JBoss AS controller core tests failed
From:Michael Musgrove (JIRA) (jira@lists.jboss.org)
Date:Apr 19, 2013 3:19:36 am
List:org.jboss.lists.jbossts-issues

[
https://issues.jboss.org/browse/JBTM-1560?page=com.atlassian.jira.plugin.system.issuetabpanels:all-tabpanel
]

Michael Musgrove updated JBTM-1560:

-----------------------------------

Status: Closed (was: Pull Request Sent) Resolution: Out of Date

We no longer run the AS tests in CI jobs so this JIRA is now out of date.

JBoss AS controller core tests failed

-------------------------------------

Key: JBTM-1560 URL: https://issues.jboss.org/browse/JBTM-1560 Project: JBoss Transaction Manager Issue Type: Bug Security Level: Public(Everyone can see) Components: Application Server Integration, Testing Reporter: Gytis Trikleris Assignee: Michael Musgrove Priority: Minor Fix For: 5.0.0.M3

Original Estimate: 4 hours Remaining Estimate: 4 hours

See: http://172.17.131.2/job/narayana-dualstack/89 {noformat} Running org.jboss.as.controller.interfaces.NotInterfaceCriteriaUnitTestCase Tests run: 2, Failures: 1, Errors: 0, Skipped: 0, Time elapsed: 0.007 sec <<<
FAILURE! Running org.jboss.as.controller.interfaces.NicInterfaceCriteriaUnitTestCase Tests run: 2, Failures: 1, Errors: 0, Skipped: 0, Time elapsed: 0.002 sec <<<
FAILURE! Running org.jboss.as.controller.interfaces.AnyInterfaceCriteriaUnitTestCase Tests run: 2, Failures: 1, Errors: 0, Skipped: 0, Time elapsed: 0.003 sec <<<
FAILURE! {noformat} {noformat} Running org.jboss.as.controller.services.path.PathsTestCase 08:09:59,677 ERROR (main) [org.jboss.as.controller.management-operation]
<AbstractOperationContext.java:478> JBAS014612: Operation ("remove") failed -
address: ([("path" => "hardcoded")]): java.lang.IllegalArgumentException:
JBAS014848: Path entry is read-only: 'hardcoded' at
org.jboss.as.controller.services.path.PathManagerService.removePathEntry(PathManagerService.java:186) at
org.jboss.as.controller.services.path.PathRemoveHandler$1.execute(PathRemoveHandler.java:100) at
org.jboss.as.controller.AbstractOperationContext.executeStep(AbstractOperationContext.java:439) at
org.jboss.as.controller.AbstractOperationContext.doCompleteStep(AbstractOperationContext.java:321) at
org.jboss.as.controller.AbstractOperationContext.completeStepInternal(AbstractOperationContext.java:228) at
org.jboss.as.controller.AbstractOperationContext.executeOperation(AbstractOperationContext.java:223) at
org.jboss.as.controller.ModelControllerImpl.internalExecute(ModelControllerImpl.java:193) at
org.jboss.as.controller.ModelControllerImpl.execute(ModelControllerImpl.java:114) at
org.jboss.as.controller.test.AbstractControllerTestBase.executeForResult(AbstractControllerTestBase.java:108) at
org.jboss.as.controller.services.path.PathsTestCase.testRemoveHardcodedPathFails(PathsTestCase.java:218) at sun.reflect.NativeMethodAccessorImpl.invoke0(Native Method) at
sun.reflect.NativeMethodAccessorImpl.invoke(NativeMethodAccessorImpl.java:57) at
sun.reflect.DelegatingMethodAccessorImpl.invoke(DelegatingMethodAccessorImpl.java:43) at java.lang.reflect.Method.invoke(Method.java:601) at
org.junit.runners.model.FrameworkMethod$1.runReflectiveCall(FrameworkMethod.java:47) at
org.junit.internal.runners.model.ReflectiveCallable.run(ReflectiveCallable.java:12) at
org.junit.runners.model.FrameworkMethod.invokeExplosively(FrameworkMethod.java:44) at
org.junit.internal.runners.statements.InvokeMethod.evaluate(InvokeMethod.java:17) at
org.junit.internal.runners.statements.RunBefores.evaluate(RunBefores.java:26) at org.junit.internal.runners.statements.RunAfters.evaluate(RunAfters.java:27) at org.junit.runners.ParentRunner.runLeaf(ParentRunner.java:271) at
org.junit.runners.BlockJUnit4ClassRunner.runChild(BlockJUnit4ClassRunner.java:70) at
org.junit.runners.BlockJUnit4ClassRunner.runChild(BlockJUnit4ClassRunner.java:50) at org.junit.runners.ParentRunner$3.run(ParentRunner.java:238) at org.junit.runners.ParentRunner$1.schedule(ParentRunner.java:63) at org.junit.runners.ParentRunner.runChildren(ParentRunner.java:236) at org.junit.runners.ParentRunner.access$000(ParentRunner.java:53) at org.junit.runners.ParentRunner$2.evaluate(ParentRunner.java:229) at org.junit.runners.ParentRunner.run(ParentRunner.java:309) at
org.apache.maven.surefire.junit4.JUnit4Provider.execute(JUnit4Provider.java:234) at
org.apache.maven.surefire.junit4.JUnit4Provider.executeTestSet(JUnit4Provider.java:133) at
org.apache.maven.surefire.junit4.JUnit4Provider.invoke(JUnit4Provider.java:114) at sun.reflect.NativeMethodAccessorImpl.invoke0(Native Method) at
sun.reflect.NativeMethodAccessorImpl.invoke(NativeMethodAccessorImpl.java:57) at
sun.reflect.DelegatingMethodAccessorImpl.invoke(DelegatingMethodAccessorImpl.java:43) at java.lang.reflect.Method.invoke(Method.java:601) at
org.apache.maven.surefire.util.ReflectionUtils.invokeMethodWithArray(ReflectionUtils.java:188) at
org.apache.maven.surefire.booter.ProviderFactory$ProviderProxy.invoke(ProviderFactory.java:166) at
org.apache.maven.surefire.booter.ProviderFactory.invokeProvider(ProviderFactory.java:86) at
org.apache.maven.surefire.booter.ForkedBooter.runSuitesInProcess(ForkedBooter.java:101) at org.apache.maven.surefire.booter.ForkedBooter.main(ForkedBooter.java:74) 08:10:00,011 ERROR (main) [org.jboss.as.controller.management-operation]
<AbstractOperationContext.java:478> JBAS014612: Operation ("write-attribute")
failed - address: ([("path" => "add1")]): java.lang.IllegalArgumentException:
JBAS014847: Could not find a path called 'add1' at
org.jboss.as.controller.services.path.PathManagerService.changeRelativePath(PathManagerService.java:253) at
org.jboss.as.controller.services.path.PathWriteAttributeHandler.applyUpdateToRuntime(PathWriteAttributeHandler.java:98) at
org.jboss.as.controller.AbstractWriteAttributeHandler$1.execute(AbstractWriteAttributeHandler.java:101) at
org.jboss.as.controller.AbstractOperationContext.executeStep(AbstractOperationContext.java:439) at
org.jboss.as.controller.AbstractOperationContext.doCompleteStep(AbstractOperationContext.java:321) at
org.jboss.as.controller.AbstractOperationContext.completeStepInternal(AbstractOperationContext.java:228) at
org.jboss.as.controller.AbstractOperationContext.executeOperation(AbstractOperationContext.java:223) at
org.jboss.as.controller.ModelControllerImpl.internalExecute(ModelControllerImpl.java:193) at
org.jboss.as.controller.ModelControllerImpl.execute(ModelControllerImpl.java:114) at
org.jboss.as.controller.test.AbstractControllerTestBase.executeForResult(AbstractControllerTestBase.java:108) at
org.jboss.as.controller.test.AbstractControllerTestBase.executeForFailure(AbstractControllerTestBase.java:117) at
org.jboss.as.controller.services.path.PathsTestCase.testBadChangeNoNotification(PathsTestCase.java:644) at sun.reflect.NativeMethodAccessorImpl.invoke0(Native Method) at
sun.reflect.NativeMethodAccessorImpl.invoke(NativeMethodAccessorImpl.java:57) at
sun.reflect.DelegatingMethodAccessorImpl.invoke(DelegatingMethodAccessorImpl.java:43) at java.lang.reflect.Method.invoke(Method.java:601) at
org.junit.runners.model.FrameworkMethod$1.runReflectiveCall(FrameworkMethod.java:47) at
org.junit.internal.runners.model.ReflectiveCallable.run(ReflectiveCallable.java:12) at
org.junit.runners.model.FrameworkMethod.invokeExplosively(FrameworkMethod.java:44) at
org.junit.internal.runners.statements.InvokeMethod.evaluate(InvokeMethod.java:17) at
org.junit.internal.runners.statements.RunBefores.evaluate(RunBefores.java:26) at org.junit.internal.runners.statements.RunAfters.evaluate(RunAfters.java:27) at org.junit.runners.ParentRunner.runLeaf(ParentRunner.java:271) at
org.junit.runners.BlockJUnit4ClassRunner.runChild(BlockJUnit4ClassRunner.java:70) at
org.junit.runners.BlockJUnit4ClassRunner.runChild(BlockJUnit4ClassRunner.java:50) at org.junit.runners.ParentRunner$3.run(ParentRunner.java:238) at org.junit.runners.ParentRunner$1.schedule(ParentRunner.java:63) at org.junit.runners.ParentRunner.runChildren(ParentRunner.java:236) at org.junit.runners.ParentRunner.access$000(ParentRunner.java:53) at org.junit.runners.ParentRunner$2.evaluate(ParentRunner.java:229) at org.junit.runners.ParentRunner.run(ParentRunner.java:309) at
org.apache.maven.surefire.junit4.JUnit4Provider.execute(JUnit4Provider.java:234) at
org.apache.maven.surefire.junit4.JUnit4Provider.executeTestSet(JUnit4Provider.java:133) at
org.apache.maven.surefire.junit4.JUnit4Provider.invoke(JUnit4Provider.java:114) at sun.reflect.NativeMethodAccessorImpl.invoke0(Native Method) at
sun.reflect.NativeMethodAccessorImpl.invoke(NativeMethodAccessorImpl.java:57) at
sun.reflect.DelegatingMethodAccessorImpl.invoke(DelegatingMethodAccessorImpl.java:43) at java.lang.reflect.Method.invoke(Method.java:601) at
org.apache.maven.surefire.util.ReflectionUtils.invokeMethodWithArray(ReflectionUtils.java:188) at
org.apache.maven.surefire.booter.ProviderFactory$ProviderProxy.invoke(ProviderFactory.java:166) at
org.apache.maven.surefire.booter.ProviderFactory.invokeProvider(ProviderFactory.java:86) at
org.apache.maven.surefire.booter.ForkedBooter.runSuitesInProcess(ForkedBooter.java:101) at org.apache.maven.surefire.booter.ForkedBooter.main(ForkedBooter.java:74) 08:10:00,217 INFO (main) [org.jboss.as.controller]
<ContainerStateMonitor.java:70> JBAS014774: Service status report JBAS014775: New missing/unsatisfied dependencies: service jboss.server.path.bad (missing) dependents: [service
jboss.server.path.add1] {noformat} {noformat} Running org.jboss.as.controller.CompositeOperationHandlerUnitTestCase ========= New Test { "outcome" => "failed", "result" => { "step-1" => { "outcome" => "failed", "result" => 1, "response-headers" => {"runtime-update-skipped" => true}, "rolled-back" => true }, "step-2" => { "outcome" => "failed", "result" => 2, "rolled-back" => true } }, "failure-description" => "JBAS014654: Composite operation was rolled back", "rolled-back" => true } ====================== ========= New Test 08:10:00,415 INFO (main) [org.jboss.as.controller]
<ContainerStateMonitor.java:70> JBAS014774: Service status report JBAS014775: New missing/unsatisfied dependencies: service jboss.missing (missing) dependents: [service
jboss.missing-service] ====================== ========= New Test { "outcome" => "success", "result" => { "step-1" => { "outcome" => "success", "result" => 1, "response-headers" => { "runtime-update-skipped" => true, "operation-requires-reload" => true } }, "step-2" => { "outcome" => "success", "result" => 2 } }, "response-headers" => {"process-state" => "reload-required"} } ====================== ========= New Test ====================== ========= New Test 08:10:00,459 ERROR (MSC service thread 77-1) [org.jboss.msc.service.fail]
<ServiceControllerImpl.java:1979> MSC000001: Failed to start service
jboss.bad-service: org.jboss.msc.service.StartException in service
jboss.bad-service: Failed to start service at
org.jboss.msc.service.ServiceControllerImpl$StartTask.run(ServiceControllerImpl.java:1928) at
java.util.concurrent.ThreadPoolExecutor.runWorker(ThreadPoolExecutor.java:1110) at
java.util.concurrent.ThreadPoolExecutor$Worker.run(ThreadPoolExecutor.java:603) at java.lang.Thread.run(Thread.java:722) Caused by: java.lang.RuntimeException: Bad service! at
org.jboss.as.controller.ModelControllerImplUnitTestCase$BadServiceHandler$1$1.start(ModelControllerImplUnitTestCase.java:900) at
org.jboss.msc.service.ServiceControllerImpl$StartTask.startService(ServiceControllerImpl.java:1972) at
org.jboss.msc.service.ServiceControllerImpl$StartTask.run(ServiceControllerImpl.java:1905) ... 3 more 08:10:00,508 INFO (main) [org.jboss.as.controller]
<ContainerStateMonitor.java:70> JBAS014774: Service status report JBAS014777: Services which failed to start: service jboss.bad-service ====================== ========= New Test ====================== ========= New Test { "outcome" => "failed", "result" => { "step-1" => { "outcome" => "failed", "result" => 1, "rolled-back" => true }, "step-2" => { "outcome" => "failed", "result" => 2, "rolled-back" => true } }, "failure-description" => "JBAS014654: Composite operation was rolled back", "rolled-back" => true } ====================== ========= New Test ====================== ========= New Test { "outcome" => "failed", "result" => { "step-1" => { "outcome" => "failed", "result" => 1, "rolled-back" => true }, "step-2" => { "outcome" => "failed", "failure-description" => "this request is bad", "rolled-back" => true } }, "failure-description" => {"JBAS014653: Composite operation failed and was
rolled back. Steps that failed:" => {"Operation step-2" => "this request is
bad"}}, "rolled-back" => true } ====================== ========= New Test { "outcome" => "failed", "result" => { "step-1" => { "outcome" => "failed", "result" => 1, "rolled-back" => true }, "step-2" => { "outcome" => "failed", "failure-description" => "this request is bad", "rolled-back" => true } }, "failure-description" => {"JBAS014653: Composite operation failed and was
rolled back. Steps that failed:" => {"Operation step-2" => "this request is
bad"}}, "rolled-back" => true } ====================== ========= New Test ====================== ========= New Test { "outcome" => "failed", "result" => { "step-1" => { "outcome" => "failed", "result" => 1, "response-headers" => {"runtime-update-skipped" => true}, "rolled-back" => true }, "step-2" => { "outcome" => "failed", "result" => 2, "rolled-back" => true } }, "failure-description" => "JBAS014654: Composite operation was rolled back", "rolled-back" => true } ====================== ========= New Test { "outcome" => "failed", "result" => { "step-1" => { "outcome" => "failed", "result" => { "step-1" => { "outcome" => "failed", "result" => 1, "rolled-back" => true }, "step-2" => { "outcome" => "failed", "result" => 2, "rolled-back" => true } }, "failure-description" => "JBAS014654: Composite operation was rolled
back", "rolled-back" => true }, "step-2" => { "outcome" => "failed", "result" => { "step-1" => { "outcome" => "failed", "result" => 2, "rolled-back" => true }, "step-2" => { "outcome" => "failed", "result" => 1, "rolled-back" => true } }, "failure-description" => "JBAS014654: Composite operation was rolled
back", "rolled-back" => true } }, "failure-description" => {"JBAS014653: Composite operation failed and was
rolled back. Steps that failed:" => { "Operation step-1" => "JBAS014654: Composite operation was rolled back", "Operation step-2" => "JBAS014654: Composite operation was rolled back" }}, "rolled-back" => true } ====================== ========= New Test 08:10:00,554 ERROR (MSC service thread 86-1) [org.jboss.msc.service.fail]
<ServiceControllerImpl.java:1979> MSC000001: Failed to start service
jboss.bad-service: org.jboss.msc.service.StartException in service
jboss.bad-service: Failed to start service at
org.jboss.msc.service.ServiceControllerImpl$StartTask.run(ServiceControllerImpl.java:1928) at
java.util.concurrent.ThreadPoolExecutor.runWorker(ThreadPoolExecutor.java:1110) at
java.util.concurrent.ThreadPoolExecutor$Worker.run(ThreadPoolExecutor.java:603) at java.lang.Thread.run(Thread.java:722) Caused by: java.lang.RuntimeException: Bad service! at
org.jboss.as.controller.ModelControllerImplUnitTestCase$BadServiceHandler$1$1.start(ModelControllerImplUnitTestCase.java:900) at
org.jboss.msc.service.ServiceControllerImpl$StartTask.startService(ServiceControllerImpl.java:1972) at
org.jboss.msc.service.ServiceControllerImpl$StartTask.run(ServiceControllerImpl.java:1905) ... 3 more 08:10:00,596 INFO (main) [org.jboss.as.controller]
<ContainerStateMonitor.java:70> JBAS014774: Service status report JBAS014777: Services which failed to start: service jboss.bad-service ====================== ========= New Test 08:10:00,605 ERROR (main) [org.jboss.as.controller.management-operation]
<AbstractOperationContext.java:478> JBAS014612: Operation ("evil") failed -
address: ([]): java.lang.RuntimeException: this handler is evil at
org.jboss.as.controller.ModelControllerImplUnitTestCase$ModelStageThrowsExceptionHandler.execute(ModelControllerImplUnitTestCase.java:704) at
org.jboss.as.controller.AbstractOperationContext.executeStep(AbstractOperationContext.java:439) at
org.jboss.as.controller.AbstractOperationContext.doCompleteStep(AbstractOperationContext.java:321) at
org.jboss.as.controller.AbstractOperationContext.completeStepInternal(AbstractOperationContext.java:228) at
org.jboss.as.controller.AbstractOperationContext.executeOperation(AbstractOperationContext.java:223) at
org.jboss.as.controller.ModelControllerImpl.internalExecute(ModelControllerImpl.java:193) at
org.jboss.as.controller.ModelControllerImpl.execute(ModelControllerImpl.java:114) at
org.jboss.as.controller.CompositeOperationHandlerUnitTestCase.testModelStageUnhandledFailureNoRollback(CompositeOperationHandlerUnitTestCase.java:157) at sun.reflect.NativeMethodAccessorImpl.invoke0(Native Method) at
sun.reflect.NativeMethodAccessorImpl.invoke(NativeMethodAccessorImpl.java:57) at
sun.reflect.DelegatingMethodAccessorImpl.invoke(DelegatingMethodAccessorImpl.java:43) at java.lang.reflect.Method.invoke(Method.java:601) at
org.junit.runners.model.FrameworkMethod$1.runReflectiveCall(FrameworkMethod.java:47) at
org.junit.internal.runners.model.ReflectiveCallable.run(ReflectiveCallable.java:12) at
org.junit.runners.model.FrameworkMethod.invokeExplosively(FrameworkMethod.java:44) at
org.junit.internal.runners.statements.InvokeMethod.evaluate(InvokeMethod.java:17) at
org.junit.internal.runners.statements.RunBefores.evaluate(RunBefores.java:26) at org.junit.internal.runners.statements.RunAfters.evaluate(RunAfters.java:27) at org.junit.runners.ParentRunner.runLeaf(ParentRunner.java:271) at
org.junit.runners.BlockJUnit4ClassRunner.runChild(BlockJUnit4ClassRunner.java:70) at
org.junit.runners.BlockJUnit4ClassRunner.runChild(BlockJUnit4ClassRunner.java:50) at org.junit.runners.ParentRunner$3.run(ParentRunner.java:238) at org.junit.runners.ParentRunner$1.schedule(ParentRunner.java:63) at org.junit.runners.ParentRunner.runChildren(ParentRunner.java:236) at org.junit.runners.ParentRunner.access$000(ParentRunner.java:53) at org.junit.runners.ParentRunner$2.evaluate(ParentRunner.java:229) at org.junit.runners.ParentRunner.run(ParentRunner.java:309) at
org.apache.maven.surefire.junit4.JUnit4Provider.execute(JUnit4Provider.java:234) at
org.apache.maven.surefire.junit4.JUnit4Provider.executeTestSet(JUnit4Provider.java:133) at
org.apache.maven.surefire.junit4.JUnit4Provider.invoke(JUnit4Provider.java:114) at sun.reflect.NativeMethodAccessorImpl.invoke0(Native Method) at
sun.reflect.NativeMethodAccessorImpl.invoke(NativeMethodAccessorImpl.java:57) at
sun.reflect.DelegatingMethodAccessorImpl.invoke(DelegatingMethodAccessorImpl.java:43) at java.lang.reflect.Method.invoke(Method.java:601) at
org.apache.maven.surefire.util.ReflectionUtils.invokeMethodWithArray(ReflectionUtils.java:188) at
org.apache.maven.surefire.booter.ProviderFactory$ProviderProxy.invoke(ProviderFactory.java:166) at
org.apache.maven.surefire.booter.ProviderFactory.invokeProvider(ProviderFactory.java:86) at
org.apache.maven.surefire.booter.ForkedBooter.runSuitesInProcess(ForkedBooter.java:101) at org.apache.maven.surefire.booter.ForkedBooter.main(ForkedBooter.java:74) { "outcome" => "failed", "result" => { "step-1" => { "outcome" => "failed", "result" => 1, "rolled-back" => true }, "step-2" => { "outcome" => "failed", "failure-description" => "JBAS014749: Operation handler failed: this
handler is evil", "rolled-back" => true } }, "failure-description" => {"JBAS014653: Composite operation failed and was
rolled back. Steps that failed:" => {"Operation step-2" => "JBAS014749:
Operation handler failed: this handler is evil"}}, "rolled-back" => true } ====================== ========= New Test { "outcome" => "success", "result" => { "step-1" => { "outcome" => "success", "result" => 1 }, "step-2" => { "outcome" => "success", "result" => 2 } } } ====================== ========= New Test { "outcome" => "success", "result" => { "step-1" => { "outcome" => "success", "result" => 1, "response-headers" => { "runtime-update-skipped" => true, "operation-requires-restart" => true } }, "step-2" => { "outcome" => "success", "result" => 2 } }, "response-headers" => {"process-state" => "restart-required"} } ====================== ========= New Test

------ ====================== ========= New Test ====================== ========= New Test { "outcome" => "success", "result" => { "step-1" => { "outcome" => "success", "result" => 1 }, "step-2" => { "outcome" => "failed", "result" => 2, "failure-description" => "OFE" } } } ====================== ========= New Test ====================== ========= New Test 08:10:00,800 ERROR (main) [org.jboss.as.controller.management-operation]
<AbstractOperationContext.java:478> JBAS014612: Operation ("runtimeException")
failed - address: ([]): java.lang.RuntimeException: runtime exception at
org.jboss.as.controller.ModelControllerImplUnitTestCase$RuntimeStageThrowsExceptionHandler$1.execute(ModelControllerImplUnitTestCase.java:769) at
org.jboss.as.controller.AbstractOperationContext.executeStep(AbstractOperationContext.java:439) at
org.jboss.as.controller.AbstractOperationContext.doCompleteStep(AbstractOperationContext.java:321) at
org.jboss.as.controller.AbstractOperationContext.completeStepInternal(AbstractOperationContext.java:228) at
org.jboss.as.controller.AbstractOperationContext.executeOperation(AbstractOperationContext.java:223) at
org.jboss.as.controller.ModelControllerImpl.internalExecute(ModelControllerImpl.java:193) at
org.jboss.as.controller.ModelControllerImpl.execute(ModelControllerImpl.java:114) at
org.jboss.as.controller.CompositeOperationHandlerUnitTestCase.testRuntimeStageUnhandledFailureNoRollback(CompositeOperationHandlerUnitTestCase.java:221) at sun.reflect.NativeMethodAccessorImpl.invoke0(Native Method) at
sun.reflect.NativeMethodAccessorImpl.invoke(NativeMethodAccessorImpl.java:57) at
sun.reflect.DelegatingMethodAccessorImpl.invoke(DelegatingMethodAccessorImpl.java:43) at java.lang.reflect.Method.invoke(Method.java:601) at
org.junit.runners.model.FrameworkMethod$1.runReflectiveCall(FrameworkMethod.java:47) at
org.junit.internal.runners.model.ReflectiveCallable.run(ReflectiveCallable.java:12) at
org.junit.runners.model.FrameworkMethod.invokeExplosively(FrameworkMethod.java:44) at
org.junit.internal.runners.statements.InvokeMethod.evaluate(InvokeMethod.java:17) at
org.junit.internal.runners.statements.RunBefores.evaluate(RunBefores.java:26) at org.junit.internal.runners.statements.RunAfters.evaluate(RunAfters.java:27) at org.junit.runners.ParentRunner.runLeaf(ParentRunner.java:271) at
org.junit.runners.BlockJUnit4ClassRunner.runChild(BlockJUnit4ClassRunner.java:70) at
org.junit.runners.BlockJUnit4ClassRunner.runChild(BlockJUnit4ClassRunner.java:50) at org.junit.runners.ParentRunner$3.run(ParentRunner.java:238) at org.junit.runners.ParentRunner$1.schedule(ParentRunner.java:63) at org.junit.runners.ParentRunner.runChildren(ParentRunner.java:236) at org.junit.runners.ParentRunner.access$000(ParentRunner.java:53) at org.junit.runners.ParentRunner$2.evaluate(ParentRunner.java:229) at org.junit.runners.ParentRunner.run(ParentRunner.java:309) at
org.apache.maven.surefire.junit4.JUnit4Provider.execute(JUnit4Provider.java:234) at
org.apache.maven.surefire.junit4.JUnit4Provider.executeTestSet(JUnit4Provider.java:133) at
org.apache.maven.surefire.junit4.JUnit4Provider.invoke(JUnit4Provider.java:114) at sun.reflect.NativeMethodAccessorImpl.invoke0(Native Method) at
sun.reflect.NativeMethodAccessorImpl.invoke(NativeMethodAccessorImpl.java:57) at
sun.reflect.DelegatingMethodAccessorImpl.invoke(DelegatingMethodAccessorImpl.java:43) at java.lang.reflect.Method.invoke(Method.java:601) at
org.apache.maven.surefire.util.ReflectionUtils.invokeMethodWithArray(ReflectionUtils.java:188) at
org.apache.maven.surefire.booter.ProviderFactory$ProviderProxy.invoke(ProviderFactory.java:166) at
org.apache.maven.surefire.booter.ProviderFactory.invokeProvider(ProviderFactory.java:86) at
org.apache.maven.surefire.booter.ForkedBooter.runSuitesInProcess(ForkedBooter.java:101) at org.apache.maven.surefire.booter.ForkedBooter.main(ForkedBooter.java:74) { "outcome" => "failed", "result" => { "step-1" => { "outcome" => "failed", "result" => 1, "rolled-back" => true }, "step-2" => { "outcome" => "failed", "result" => 2, "failure-description" => "JBAS014749: Operation handler failed:
runtime exception", "rolled-back" => true } }, "failure-description" => {"JBAS014653: Composite operation failed and was
rolled back. Steps that failed:" => {"Operation step-2" => "JBAS014749:
Operation handler failed: runtime exception"}}, "rolled-back" => true } ====================== ========= New Test { "outcome" => "failed", "result" => {"step-1" => { "outcome" => "failed", "result" => 2, "rolled-back" => true }}, "failure-description" => "JBAS014654: Composite operation was rolled back", "rolled-back" => true } ====================== ========= New Test 08:10:00,975 ERROR (main) [org.jboss.as.controller.management-operation]
<AbstractOperationContext.java:478> JBAS014612: Operation ("evil") failed -
address: ([]): java.lang.RuntimeException: this handler is evil at
org.jboss.as.controller.ModelControllerImplUnitTestCase$ModelStageThrowsExceptionHandler.execute(ModelControllerImplUnitTestCase.java:704) at
org.jboss.as.controller.AbstractOperationContext.executeStep(AbstractOperationContext.java:439) at
org.jboss.as.controller.AbstractOperationContext.doCompleteStep(AbstractOperationContext.java:321) at
org.jboss.as.controller.AbstractOperationContext.completeStepInternal(AbstractOperationContext.java:228) at
org.jboss.as.controller.AbstractOperationContext.executeOperation(AbstractOperationContext.java:223) at
org.jboss.as.controller.ModelControllerImpl.internalExecute(ModelControllerImpl.java:193) at
org.jboss.as.controller.ModelControllerImpl.execute(ModelControllerImpl.java:114) at
org.jboss.as.controller.CompositeOperationHandlerUnitTestCase.testModelStageUnhandledFailure(CompositeOperationHandlerUnitTestCase.java:123) at sun.reflect.NativeMethodAccessorImpl.invoke0(Native Method) at
sun.reflect.NativeMethodAccessorImpl.invoke(NativeMethodAccessorImpl.java:57) at
sun.reflect.DelegatingMethodAccessorImpl.invoke(DelegatingMethodAccessorImpl.java:43) at java.lang.reflect.Method.invoke(Method.java:601) at
org.junit.runners.model.FrameworkMethod$1.runReflectiveCall(FrameworkMethod.java:47) at
org.junit.internal.runners.model.ReflectiveCallable.run(ReflectiveCallable.java:12) at
org.junit.runners.model.FrameworkMethod.invokeExplosively(FrameworkMethod.java:44) at
org.junit.internal.runners.statements.InvokeMethod.evaluate(InvokeMethod.java:17) at
org.junit.internal.runners.statements.RunBefores.evaluate(RunBefores.java:26) at org.junit.internal.runners.statements.RunAfters.evaluate(RunAfters.java:27) at org.junit.runners.ParentRunner.runLeaf(ParentRunner.java:271) at
org.junit.runners.BlockJUnit4ClassRunner.runChild(BlockJUnit4ClassRunner.java:70) at
org.junit.runners.BlockJUnit4ClassRunner.runChild(BlockJUnit4ClassRunner.java:50) at org.junit.runners.ParentRunner$3.run(ParentRunner.java:238) at org.junit.runners.ParentRunner$1.schedule(ParentRunner.java:63) at org.junit.runners.ParentRunner.runChildren(ParentRunner.java:236) at org.junit.runners.ParentRunner.access$000(ParentRunner.java:53) at org.junit.runners.ParentRunner$2.evaluate(ParentRunner.java:229) at org.junit.runners.ParentRunner.run(ParentRunner.java:309) at
org.apache.maven.surefire.junit4.JUnit4Provider.execute(JUnit4Provider.java:234) at
org.apache.maven.surefire.junit4.JUnit4Provider.executeTestSet(JUnit4Provider.java:133) at
org.apache.maven.surefire.junit4.JUnit4Provider.invoke(JUnit4Provider.java:114) at sun.reflect.NativeMethodAccessorImpl.invoke0(Native Method) at
sun.reflect.NativeMethodAccessorImpl.invoke(NativeMethodAccessorImpl.java:57) at
sun.reflect.DelegatingMethodAccessorImpl.invoke(DelegatingMethodAccessorImpl.java:43) at java.lang.reflect.Method.invoke(Method.java:601) at
org.apache.maven.surefire.util.ReflectionUtils.invokeMethodWithArray(ReflectionUtils.java:188) at
org.apache.maven.surefire.booter.ProviderFactory$ProviderProxy.invoke(ProviderFactory.java:166) at
org.apache.maven.surefire.booter.ProviderFactory.invokeProvider(ProviderFactory.java:86) at
org.apache.maven.surefire.booter.ForkedBooter.runSuitesInProcess(ForkedBooter.java:101) at org.apache.maven.surefire.booter.ForkedBooter.main(ForkedBooter.java:74) ====================== ========= New Test 08:10:01,151 INFO (main) [org.jboss.as.controller]
<ContainerStateMonitor.java:70> JBAS014774: Service status report JBAS014775: New missing/unsatisfied dependencies: service jboss.missing (missing) dependents: [service
jboss.missing-service] ====================== Tests run: 25, Failures: 0, Errors: 0, Skipped: 0, Time elapsed: 0.764 sec Running org.jboss.as.controller.ModelControllerImplUnitTestCase 08:10:01,164 ERROR (main) [org.jboss.as.controller.management-operation]
<AbstractOperationContext.java:478> JBAS014612: Operation ("evil") failed -
address: ([]): java.lang.RuntimeException: this handler is evil at
org.jboss.as.controller.ModelControllerImplUnitTestCase$ModelStageThrowsExceptionHandler.execute(ModelControllerImplUnitTestCase.java:704) at
org.jboss.as.controller.AbstractOperationContext.executeStep(AbstractOperationContext.java:439) at
org.jboss.as.controller.AbstractOperationContext.doCompleteStep(AbstractOperationContext.java:321) at
org.jboss.as.controller.AbstractOperationContext.completeStepInternal(AbstractOperationContext.java:228) at
org.jboss.as.controller.AbstractOperationContext.executeOperation(AbstractOperationContext.java:223) at
org.jboss.as.controller.ModelControllerImpl.internalExecute(ModelControllerImpl.java:193) at
org.jboss.as.controller.ModelControllerImpl.execute(ModelControllerImpl.java:114) at
org.jboss.as.controller.ModelControllerImplUnitTestCase.testModelStageUnhandledFailureExecution(ModelControllerImplUnitTestCase.java:179) at sun.reflect.NativeMethodAccessorImpl.invoke0(Native Method) at
sun.reflect.NativeMethodAccessorImpl.invoke(NativeMethodAccessorImpl.java:57) at
sun.reflect.DelegatingMethodAccessorImpl.invoke(DelegatingMethodAccessorImpl.java:43) at java.lang.reflect.Method.invoke(Method.java:601) at
org.junit.runners.model.FrameworkMethod$1.runReflectiveCall(FrameworkMethod.java:47) at
org.junit.internal.runners.model.ReflectiveCallable.run(ReflectiveCallable.java:12) at
org.junit.runners.model.FrameworkMethod.invokeExplosively(FrameworkMethod.java:44) at
org.junit.internal.runners.statements.InvokeMethod.evaluate(InvokeMethod.java:17) at
org.junit.internal.runners.statements.RunBefores.evaluate(RunBefores.java:26) at org.junit.internal.runners.statements.RunAfters.evaluate(RunAfters.java:27) at org.junit.runners.ParentRunner.runLeaf(ParentRunner.java:271) at
org.junit.runners.BlockJUnit4ClassRunner.runChild(BlockJUnit4ClassRunner.java:70) at
org.junit.runners.BlockJUnit4ClassRunner.runChild(BlockJUnit4ClassRunner.java:50) at org.junit.runners.ParentRunner$3.run(ParentRunner.java:238) at org.junit.runners.ParentRunner$1.schedule(ParentRunner.java:63) at org.junit.runners.ParentRunner.runChildren(ParentRunner.java:236) at org.junit.runners.ParentRunner.access$000(ParentRunner.java:53) at org.junit.runners.ParentRunner$2.evaluate(ParentRunner.java:229) at org.junit.runners.ParentRunner.run(ParentRunner.java:309) at
org.apache.maven.surefire.junit4.JUnit4Provider.execute(JUnit4Provider.java:234) at
org.apache.maven.surefire.junit4.JUnit4Provider.executeTestSet(JUnit4Provider.java:133) at
org.apache.maven.surefire.junit4.JUnit4Provider.invoke(JUnit4Provider.java:114) at sun.reflect.NativeMethodAccessorImpl.invoke0(Native Method) at
sun.reflect.NativeMethodAccessorImpl.invoke(NativeMethodAccessorImpl.java:57) at
sun.reflect.DelegatingMethodAccessorImpl.invoke(DelegatingMethodAccessorImpl.java:43) at java.lang.reflect.Method.invoke(Method.java:601) at
org.apache.maven.surefire.util.ReflectionUtils.invokeMethodWithArray(ReflectionUtils.java:188) at
org.apache.maven.surefire.booter.ProviderFactory$ProviderProxy.invoke(ProviderFactory.java:166) at
org.apache.maven.surefire.booter.ProviderFactory.invokeProvider(ProviderFactory.java:86) at
org.apache.maven.surefire.booter.ForkedBooter.runSuitesInProcess(ForkedBooter.java:101) at org.apache.maven.surefire.booter.ForkedBooter.main(ForkedBooter.java:74) { "outcome" => "success", "result" => 5 } { "outcome" => "failed", "result" => 1, "response-headers" => {"runtime-update-skipped" => true}, "rolled-back" => true } 08:10:01,330 INFO (main) [org.jboss.as.controller]
<ContainerStateMonitor.java:70> JBAS014774: Service status report JBAS014775: New missing/unsatisfied dependencies: service jboss.missing (missing) dependents: [service
jboss.missing-service] { "outcome" => "failed", "result" => 1, "failure-description" => {"JBAS014771: Services with missing/unavailable
dependencies" => ["jboss.missing-service is missing [jboss.missing]"]}, "rolled-back" => true } { "outcome" => "success", "result" => 1, "response-headers" => { "runtime-update-skipped" => true, "operation-requires-reload" => true, "process-state" => "reload-required" } } { "outcome" => "failed", "result" => 1, "response-headers" => {"runtime-update-skipped" => true}, "rolled-back" => true } { "outcome" => "success", "result" => 1 } { "outcome" => "failed", "result" => 5, "failure-description" => "JBAS014762: Removing services has lead to
unsatisfied dependencies: Service jboss.depended-service was depended upon by service
jboss.dependent-service", "rolled-back" => true } {"outcome" => "success"} { "outcome" => "failed", "result" => 1, "rolled-back" => true } 08:10:01,377 ERROR (MSC service thread 110-1) [org.jboss.msc.service.fail]
<ServiceControllerImpl.java:1979> MSC000001: Failed to start service
jboss.bad-service: org.jboss.msc.service.StartException in service
jboss.bad-service: Failed to start service at
org.jboss.msc.service.ServiceControllerImpl$StartTask.run(ServiceControllerImpl.java:1928) at
java.util.concurrent.ThreadPoolExecutor.runWorker(ThreadPoolExecutor.java:1110) at
java.util.concurrent.ThreadPoolExecutor$Worker.run(ThreadPoolExecutor.java:603) at java.lang.Thread.run(Thread.java:722) Caused by: java.lang.RuntimeException: Bad service! at
org.jboss.as.controller.ModelControllerImplUnitTestCase$BadServiceHandler$1$1.start(ModelControllerImplUnitTestCase.java:900) at
org.jboss.msc.service.ServiceControllerImpl$StartTask.startService(ServiceControllerImpl.java:1972) at
org.jboss.msc.service.ServiceControllerImpl$StartTask.run(ServiceControllerImpl.java:1905) ... 3 more 08:10:01,415 INFO (main) [org.jboss.as.controller]
<ContainerStateMonitor.java:70> JBAS014774: Service status report JBAS014777: Services which failed to start: service jboss.bad-service { "outcome" => "failed", "result" => 1, "failure-description" => {"JBAS014671: Failed services" =>
{"jboss.bad-service" => "org.jboss.msc.service.StartException in service
jboss.bad-service: Failed to start service Caused by: java.lang.RuntimeException: Bad service!"}}, "rolled-back" => true } { "outcome" => "success", "result" => 1, "response-headers" => { "runtime-update-skipped" => true, "operation-requires-restart" => true, "process-state" => "restart-required" } } { "outcome" => "failed", "result" => 1, "rolled-back" => true } 08:10:01,433 ERROR (main) [org.jboss.as.controller.management-operation]
<AbstractOperationContext.java:478> JBAS014612: Operation ("runtimeException")
failed - address: ([]): java.lang.RuntimeException: runtime exception at
org.jboss.as.controller.ModelControllerImplUnitTestCase$RuntimeStageThrowsExceptionHandler$1.execute(ModelControllerImplUnitTestCase.java:769) at
org.jboss.as.controller.AbstractOperationContext.executeStep(AbstractOperationContext.java:439) at
org.jboss.as.controller.AbstractOperationContext.doCompleteStep(AbstractOperationContext.java:321) at
org.jboss.as.controller.AbstractOperationContext.completeStepInternal(AbstractOperationContext.java:228) at
org.jboss.as.controller.AbstractOperationContext.executeOperation(AbstractOperationContext.java:223) at
org.jboss.as.controller.ModelControllerImpl.internalExecute(ModelControllerImpl.java:193) at
org.jboss.as.controller.ModelControllerImpl.execute(ModelControllerImpl.java:114) at
org.jboss.as.controller.ModelControllerImplUnitTestCase.testRuntimeStageUnhandledFailureNoRollback(ModelControllerImplUnitTestCase.java:230) at sun.reflect.NativeMethodAccessorImpl.invoke0(Native Method) at
sun.reflect.NativeMethodAccessorImpl.invoke(NativeMethodAccessorImpl.java:57) at
sun.reflect.DelegatingMethodAccessorImpl.invoke(DelegatingMethodAccessorImpl.java:43) at java.lang.reflect.Method.invoke(Method.java:601) at
org.junit.runners.model.FrameworkMethod$1.runReflectiveCall(FrameworkMethod.java:47) at
org.junit.internal.runners.model.ReflectiveCallable.run(ReflectiveCallable.java:12) at
org.junit.runners.model.FrameworkMethod.invokeExplosively(FrameworkMethod.java:44) at
org.junit.internal.runners.statements.InvokeMethod.evaluate(InvokeMethod.java:17) at
org.junit.internal.runners.statements.RunBefores.evaluate(RunBefores.java:26) at org.junit.internal.runners.statements.RunAfters.evaluate(RunAfters.java:27) at org.junit.runners.ParentRunner.runLeaf(ParentRunner.java:271) at
org.junit.runners.BlockJUnit4ClassRunner.runChild(BlockJUnit4ClassRunner.java:70) at
org.junit.runners.BlockJUnit4ClassRunner.runChild(BlockJUnit4ClassRunner.java:50) at org.junit.runners.ParentRunner$3.run(ParentRunner.java:238) at org.junit.runners.ParentRunner$1.schedule(ParentRunner.java:63) at org.junit.runners.ParentRunner.runChildren(ParentRunner.java:236) at org.junit.runners.ParentRunner.access$000(ParentRunner.java:53) at org.junit.runners.ParentRunner$2.evaluate(ParentRunner.java:229) at org.junit.runners.ParentRunner.run(ParentRunner.java:309) at
org.apache.maven.surefire.junit4.JUnit4Provider.execute(JUnit4Provider.java:234) at
org.apache.maven.surefire.junit4.JUnit4Provider.executeTestSet(JUnit4Provider.java:133) at
org.apache.maven.surefire.junit4.JUnit4Provider.invoke(JUnit4Provider.java:114) at sun.reflect.NativeMethodAccessorImpl.invoke0(Native Method) at
sun.reflect.NativeMethodAccessorImpl.invoke(NativeMethodAccessorImpl.java:57) at
sun.reflect.DelegatingMethodAccessorImpl.invoke(DelegatingMethodAccessorImpl.java:43) at java.lang.reflect.Method.invoke(Method.java:601) at
org.apache.maven.surefire.util.ReflectionUtils.invokeMethodWithArray(ReflectionUtils.java:188) at
org.apache.maven.surefire.booter.ProviderFactory$ProviderProxy.invoke(ProviderFactory.java:166) at
org.apache.maven.surefire.booter.ProviderFactory.invokeProvider(ProviderFactory.java:86) at
org.apache.maven.surefire.booter.ForkedBooter.runSuitesInProcess(ForkedBooter.java:101) at org.apache.maven.surefire.booter.ForkedBooter.main(ForkedBooter.java:74) 08:10:01,595 ERROR (MSC service thread 115-1) [org.jboss.msc.service.fail]
<ServiceControllerImpl.java:1979> MSC000001: Failed to start service
jboss.bad-service: org.jboss.msc.service.StartException in service
jboss.bad-service: Failed to start service at
org.jboss.msc.service.ServiceControllerImpl$StartTask.run(ServiceControllerImpl.java:1928) at
java.util.concurrent.ThreadPoolExecutor.runWorker(ThreadPoolExecutor.java:1110) at
java.util.concurrent.ThreadPoolExecutor$Worker.run(ThreadPoolExecutor.java:603) at java.lang.Thread.run(Thread.java:722) Caused by: java.lang.RuntimeException: Bad service! at
org.jboss.as.controller.ModelControllerImplUnitTestCase$BadServiceHandler$1$1.start(ModelControllerImplUnitTestCase.java:900) at
org.jboss.msc.service.ServiceControllerImpl$StartTask.startService(ServiceControllerImpl.java:1972) at
org.jboss.msc.service.ServiceControllerImpl$StartTask.run(ServiceControllerImpl.java:1905) ... 3 more 08:10:01,631 INFO (main) [org.jboss.as.controller]
<ContainerStateMonitor.java:70> JBAS014774: Service status report JBAS014777: Services which failed to start: service jboss.bad-service:
org.jboss.msc.service.StartException in service jboss.bad-service: Failed to
start service 08:10:01,638 INFO (main) [org.jboss.as.controller]
<ContainerStateMonitor.java:70> JBAS014774: Service status report JBAS014777: Services which failed to start: service jboss.bad-service { "outcome" => "success", "result" => 1 } Tests run: 22, Failures: 0, Errors: 0, Skipped: 0, Time elapsed: 0.505 sec Running org.jboss.as.controller.ObjectListAttributeDefinitionUnitTestCase Tests run: 1, Failures: 0, Errors: 0, Skipped: 0, Time elapsed: 0.005 sec Running org.jboss.as.controller.OperationCancellationUnitTestCase ========= New Test 08:10:01,676 ERROR (pool-23-thread-1)
[org.jboss.as.controller.management-operation]
<AbstractOperationContext.java:478> JBAS014612: Operation ("block-model") failed
- address: ([]): java.lang.RuntimeException: java.lang.InterruptedException at
org.jboss.as.controller.OperationCancellationUnitTestCase.block(OperationCancellationUnitTestCase.java:145) at
org.jboss.as.controller.OperationCancellationUnitTestCase.access$000(OperationCancellationUnitTestCase.java:70) at
org.jboss.as.controller.OperationCancellationUnitTestCase$ModelStageBlocksHandler.execute(OperationCancellationUnitTestCase.java:322) at
org.jboss.as.controller.AbstractOperationContext.executeStep(AbstractOperationContext.java:439) at
org.jboss.as.controller.AbstractOperationContext.doCompleteStep(AbstractOperationContext.java:321) at
org.jboss.as.controller.AbstractOperationContext.completeStepInternal(AbstractOperationContext.java:228) at
org.jboss.as.controller.AbstractOperationContext.executeOperation(AbstractOperationContext.java:223) at
org.jboss.as.controller.ModelControllerImpl.internalExecute(ModelControllerImpl.java:193) at
org.jboss.as.controller.ModelControllerImpl.execute(ModelControllerImpl.java:114) at
org.jboss.as.controller.ModelControllerImpl$3$1.run(ModelControllerImpl.java:458) at
java.util.concurrent.ThreadPoolExecutor.runWorker(ThreadPoolExecutor.java:1110) at
java.util.concurrent.ThreadPoolExecutor$Worker.run(ThreadPoolExecutor.java:603) at java.lang.Thread.run(Thread.java:722) Caused by: java.lang.InterruptedException at
java.util.concurrent.locks.AbstractQueuedSynchronizer.acquireSharedInterruptibly(AbstractQueuedSynchronizer.java:1301) at java.util.concurrent.CountDownLatch.await(CountDownLatch.java:236) at
org.jboss.as.controller.OperationCancellationUnitTestCase.block(OperationCancellationUnitTestCase.java:143) ... 12 more ========= New Test ========= New Test 08:10:01,789 ERROR (pool-23-thread-2)
[org.jboss.as.controller.management-operation]
<AbstractOperationContext.java:478> JBAS014612: Operation ("block-runtime")
failed - address: ([]): java.lang.RuntimeException:
java.lang.InterruptedException at
org.jboss.as.controller.OperationCancellationUnitTestCase.block(OperationCancellationUnitTestCase.java:145) at
org.jboss.as.controller.OperationCancellationUnitTestCase.access$000(OperationCancellationUnitTestCase.java:70) at
org.jboss.as.controller.OperationCancellationUnitTestCase$RuntimeStageBlocksHandler$1.execute(OperationCancellationUnitTestCase.java:351) at
org.jboss.as.controller.AbstractOperationContext.executeStep(AbstractOperationContext.java:439) at
org.jboss.as.controller.AbstractOperationContext.doCompleteStep(AbstractOperationContext.java:321) at
org.jboss.as.controller.AbstractOperationContext.completeStepInternal(AbstractOperationContext.java:228) at
org.jboss.as.controller.AbstractOperationContext.executeOperation(AbstractOperationContext.java:223) at
org.jboss.as.controller.ModelControllerImpl.internalExecute(ModelControllerImpl.java:193) at
org.jboss.as.controller.ModelControllerImpl.execute(ModelControllerImpl.java:114) at
org.jboss.as.controller.ModelControllerImpl$3$1.run(ModelControllerImpl.java:458) at
java.util.concurrent.ThreadPoolExecutor.runWorker(ThreadPoolExecutor.java:1110) at
java.util.concurrent.ThreadPoolExecutor$Worker.run(ThreadPoolExecutor.java:603) at java.lang.Thread.run(Thread.java:722) Caused by: java.lang.InterruptedException at
java.util.concurrent.locks.AbstractQueuedSynchronizer.doAcquireSharedInterruptibly(AbstractQueuedSynchronizer.java:996) at
java.util.concurrent.locks.AbstractQueuedSynchronizer.acquireSharedInterruptibly(AbstractQueuedSynchronizer.java:1303) at java.util.concurrent.CountDownLatch.await(CountDownLatch.java:236) at
org.jboss.as.controller.OperationCancellationUnitTestCase.block(OperationCancellationUnitTestCase.java:143) ... 12 more ========= New Test 08:10:01,900 WARN (pool-23-thread-2)
[org.jboss.as.controller.management-operation] <OperationContextImpl.java:703>
JBAS014626: Operation was interrupted before stability could be reached Tests run: 4, Failures: 0, Errors: 0, Skipped: 0, Time elapsed: 0.251 sec Results : Failed tests:
testMultipleCriteria(org.jboss.as.controller.interfaces.NotInterfaceCriteriaUnitTestCase):
expected:<{name:eth0 (eth0)=[/fe80:0:0:0:5054:ff:fe25:bb%2]}> but
was:<{name:eth0 (eth0)=[/172.17.131.20, /fe80:0:0:0:5054:ff:fe25:bb%2]}> testBasic(org.jboss.as.controller.interfaces.NicInterfaceCriteriaUnitTestCase):
expected:<[/0:0:0:0:0:0:0:1%1]> but was:<[/0:0:0:0:0:0:0:1%1, /127.0.0.1]> testMultipleCriteria(org.jboss.as.controller.interfaces.AnyInterfaceCriteriaUnitTestCase):
expected:<{name:lo (lo)=[/0:0:0:0:0:0:0:1%1], name:eth0
(eth0)=[/fe80:0:0:0:5054:ff:fe25:bb%2]}> but was:<{name:lo (lo)=[/127.0.0.1,
/0:0:0:0:0:0:0:1%1], name:eth0 (eth0)=[/172.17.131.20,
/fe80:0:0:0:5054:ff:fe25:bb%2]}> Tests run: 282, Failures: 3, Errors: 0, Skipped: 3 {noformat}